Methyl 3-butenoate
- Formula: C5H8O2
- Molecular weight: 100.1158
- IUPAC Standard InChIKey: GITITJADGZYSRL-UHFFFAOYSA-N
- CAS Registry Number: 3724-55-8
- Chemical structure:
View 3d structure (requires JavaScript / HTML 5) - Other names: CH2=CHCH2C(O)OCH3; 3-Butenoic acid, methyl ester

Kovats' RI, non-polar column, isothermal

Column type | Active phase | Temperature (C) | I | Reference | Comment |
---|---|---|---|---|---|
Packed | SE-30 | 150. | 692. | Ashes and Haken, 1975 | He, Celatom silanized (62-72 mesh); Column length: 3.7 m |
Packed | OV-1 | 150. | 693. | Ashes and Haken, 1971 |

Normal alkane RI, non-polar column, temperature ramp

Column type | Active phase | I | Reference | Comment |
---|---|---|---|---|
Capillary | Ultra-ALLOY-5 | 718. | Tsuge, Ohtan, et al., 2011 | 30. m/0.25 mm/0.25 μm, 40. C @ 2. min, 20. K/min, 320. C @ 13. min |
Capillary | OV-101 | 710. | Zenkevich, 2005 | 25. m/0.20 mm/0.10 μm, N2/He, 6. K/min; Tstart: 50. C; Tend: 250. C |

References

Ashes and Haken, 1975
Ashes, J.R.; Haken, J.K.,
Gas chromatography of homologous esters. IX. Structure-retention increments of unsaturated esters,
J. Chromatogr., 1975, 111, 1, 171-187, https://doi.org/10.1016/S0021-9673(01)80159-X
. [all data]
Ashes and Haken, 1971
Ashes, J.R.; Haken, J.K.,
Gas chromatography of homologous esters. Part V. Retention of aliphatic esters on non-polar, donar and acceptor stationary phases,
J. Chromatogr., 1971, 60, 33-44, https://doi.org/10.1016/S0021-9673(00)95527-4
. [all data]
Tsuge, Ohtan, et al., 2011
Tsuge, S.; Ohtan, H.; Watanabe, C.,
Pyrolysis - GC/MS Data Book of Synthetic Polymers, Elsevier, 2011, 420. [all data]
Zenkevich, 2005
Zenkevich, I.G.,
Experimentally measured retention indices., 2005. [all data]