Acetic acid, cyano-
- Formula: C3H3NO2
- Molecular weight: 85.0614
- IUPAC Standard InChIKey: MLIREBYILWEBDM-UHFFFAOYSA-N
- CAS Registry Number: 372-09-8
- Chemical structure:
View 3d structure (requires JavaScript / HTML 5) - Other names: Cyanoacetic acid; Malonic mononitrile; Monocyanoacetic acid; NCCH2COOH; 2-Cyanoacetic acid; Acide cyanacetique; USAF KF-17; Cyanessigsaeure; Kyselina kyanoctova; Cyanoethanoic acid; NSC 5571

Condensed phase thermochemistry data

Data compiled by: Hussein Y. Afeefy, Joel F. Liebman, and Stephen E. Stein
Quantity | Value | Units | Method | Reference | Comment |
---|---|---|---|---|---|
ΔfH°solid | -355.6 | kJ/mol | Ccb | Guinchant, 1918 | Author hf288_condensed[kcal/mol]=-87.2 kcal/mol |
Quantity | Value | Units | Method | Reference | Comment |
ΔcH°solid | -1254. | kJ/mol | Ccb | Guinchant, 1918 | Author hf288_condensed[kcal/mol]=-87.2 kcal/mol |

Phase change data

Data compiled by: Robert L. Brown and Stephen E. Stein
Reduced pressure boiling point
Tboil (K) | Pressure (bar) | Reference |
---|---|---|
381.2 | 0.0003 | Aldrich Chemical Company Inc., 1990 |

Reaction thermochemistry data

Data compiled as indicated in comments:
B - John E. Bartmess
ALS - Hussein Y. Afeefy, Joel F. Liebman, and Stephen E. Stein
Individual Reactions
C3H2NO2- + =
By formula: C3H2NO2- + H+ = C3H3NO2
Quantity | Value | Units | Method | Reference | Comment |
---|---|---|---|---|---|
ΔrH° | 1382. ± 8.8 | kJ/mol | G+TS | Taft and Topsom, 1987 | gas phase; B |
Quantity | Value | Units | Method | Reference | Comment |
ΔrG° | 1354. ± 8.4 | kJ/mol | IMRE | Taft and Topsom, 1987 | gas phase; B |
By formula: C4H5NO2 + H2O = C3H3NO2 + CH4O
Quantity | Value | Units | Method | Reference | Comment |
---|---|---|---|---|---|
ΔrH° | -54. ± 2. | kJ/mol | Eqk | Guthrie and Cullimore, 1980 | liquid phase; ALS |

Gas phase ion energetics data

Data compiled by: John E. Bartmess
De-protonation reactions
C3H2NO2- + =
By formula: C3H2NO2- + H+ = C3H3NO2
Quantity | Value | Units | Method | Reference | Comment |
---|---|---|---|---|---|
ΔrH° | 1382. ± 8.8 | kJ/mol | G+TS | Taft and Topsom, 1987 | gas phase |
Quantity | Value | Units | Method | Reference | Comment |
ΔrG° | 1354. ± 8.4 | kJ/mol | IMRE | Taft and Topsom, 1987 | gas phase |

References

Guinchant, 1918
Guinchant, M.J.,
Etude sur la fonction acide dans les derives metheniques et methiniques,
Ann. Chem., 1918, 10, 30-84. [all data]
Aldrich Chemical Company Inc., 1990
Aldrich Chemical Company Inc.,
Catalog Handbook of Fine Chemicals, Aldrich Chemical Company, Inc., Milwaukee WI, 1990, 1. [all data]
Taft and Topsom, 1987
Taft, R.W.; Topsom, R.D.,
The Nature and Analysis of Substituent Effects,
Prog. Phys. Org. Chem., 1987, 16, 1. [all data]
Guthrie and Cullimore, 1980
Guthrie, J.P.; Cullimore, P.A.,
Effect of the acyl substituent on the equilibrium constant for hydration of esters,
Can. J. Chem., 1980, 58, 1281-1294. [all data]