C10H18NO3

Reaction thermochemistry data

Data compiled by: John E. Bartmess

Individual Reactions

C10H17NO3- + Hydrogen cation = C10H18NO3

By formula: C10H17NO3- + H+ = C10H18NO3

Quantity Value Units Method Reference Comment
Δr1411. ± 8.8kJ/molCIDCGryn'ova, Marshall, et al., 2013gas phase

References

Gryn'ova, Marshall, et al., 2013
Gryn'ova, G.; Marshall, D.L.; Blanksby, S.J.; Coote, M.L., Switching Radical Stability by pH-Induced Orbital Conversion, Nat. Chem., 2013, 5, 6, 474-481, https://doi.org/10.1038/nchem.1625 . [all data]