p-Fluoroaniline
- Formula: C6H6FN
- Molecular weight: 111.1169
- IUPAC Standard InChIKey: KRZCOLNOCZKSDF-UHFFFAOYSA-N
- CAS Registry Number: 371-40-4
- Chemical structure:
View 3d structure (requires JavaScript / HTML 5) - Other names: Benzenamine, 4-fluoro-; Aniline, p-fluoro-; p-Fluorophenylamine; 4-Fluoroaniline; 4-Fluoronaniline; 4-Fluorobenzenamine; Aniline, 4-fluoro-; 1-Amino-4-fluorobenzene; 4-Fluoranilin; UN 2944; NSC 579

Condensed phase thermochemistry data

Data compiled as indicated in comments:
ALS - Hussein Y. Afeefy, Joel F. Liebman, and Stephen E. Stein
DH - Eugene S. Domalski and Elizabeth D. Hearing
Quantity | Value | Units | Method | Reference | Comment |
---|---|---|---|---|---|
ΔcH°liquid | -3273. | kJ/mol | Ccb | Swarts, 1919 | Not corrected for CODATA value of ΔfH; ALS |
Constant pressure heat capacity of liquid
Cp,liquid (J/mol*K) | Temperature (K) | Reference | Comment |
---|---|---|---|
195.2 | 298.15 | Lichanot, 1991 | T = 175 to 333 K. Cp(liq) = 192.943 + 0.092T(°C) J/mol*K (-49 to 60°C). Cp value calculated from equation.; DH |

Phase change data

Data compiled as indicated in comments:
BS - Robert L. Brown and Stephen E. Stein
DH - Eugene S. Domalski and Elizabeth D. Hearing
TRC - Thermodynamics Research Center, NIST Boulder Laboratories, Chris Muzny director
AC - William E. Acree, Jr., James S. Chickos
Quantity | Value | Units | Method | Reference | Comment |
---|---|---|---|---|---|
Tboil | 461. | K | N/A | PCR Inc., 1990 | BS |
Quantity | Value | Units | Method | Reference | Comment |
Tfus | 271.25 | K | N/A | Lichanot, 1991 | DH |
Tfus | 314.65 | K | N/A | Popp, 1964 | Uncertainty assigned by TRC = 1.5 K; TRC |
Quantity | Value | Units | Method | Reference | Comment |
ΔvapH° | 54.8 ± 0.8 | kJ/mol | C | Ribeiro da Silva, Ferreira, et al., 2007 | AC |
Reduced pressure boiling point
Tboil (K) | Pressure (bar) | Reference | Comment |
---|---|---|---|
460.2 | 1.02 | Aldrich Chemical Company Inc., 1990 | BS |
358.2 | 0.025 | Weast and Grasselli, 1989 | BS |

Reaction thermochemistry data

Data compiled by: John E. Bartmess
Individual Reactions
C6H5FN- + =
By formula: C6H5FN- + H+ = C6H6FN
Quantity | Value | Units | Method | Reference | Comment |
---|---|---|---|---|---|
ΔrH° | 1524. ± 8.8 | kJ/mol | G+TS | Bartmess, Scott, et al., 1979 | gas phase; value altered from reference due to change in acidity scale |
Quantity | Value | Units | Method | Reference | Comment |
ΔrG° | 1494. ± 8.4 | kJ/mol | IMRE | Bartmess, Scott, et al., 1979 | gas phase; value altered from reference due to change in acidity scale |

Gas phase ion energetics data

Data evaluated as indicated in comments:
HL - Edward P. Hunter and Sharon G. Lias
Data compiled as indicated in comments:
B - John E. Bartmess
LBLHLM - Sharon G. Lias, John E. Bartmess, Joel F. Liebman, John L. Holmes, Rhoda D. Levin, and W. Gary Mallard
LLK - Sharon G. Lias, Rhoda D. Levin, and Sherif A. Kafafi
RDSH - Henry M. Rosenstock, Keith Draxl, Bruce W. Steiner, and John T. Herron
Quantity | Value | Units | Method | Reference | Comment |
---|---|---|---|---|---|
Proton affinity (review) | 208.3 | kcal/mol | N/A | Hunter and Lias, 1998 | HL |
Quantity | Value | Units | Method | Reference | Comment |
Gas basicity | 200.7 | kcal/mol | N/A | Hunter and Lias, 1998 | HL |
Ionization energy determinations
IE (eV) | Method | Reference | Comment |
---|---|---|---|
7.9 ± 0.1 | CTS | Farrell and Newton, 1966 | RDSH |
8.18 | PE | Furin, Sultanov, et al., 1987 | Vertical value; LBLHLM |
8.18 | PE | Palmer, Moyes, et al., 1979 | Vertical value; LLK |
De-protonation reactions
C6H5FN- + =
By formula: C6H5FN- + H+ = C6H6FN
Quantity | Value | Units | Method | Reference | Comment |
---|---|---|---|---|---|
ΔrH° | 364.3 ± 2.1 | kcal/mol | G+TS | Bartmess, Scott, et al., 1979 | gas phase; value altered from reference due to change in acidity scale; B |
Quantity | Value | Units | Method | Reference | Comment |
ΔrG° | 357.0 ± 2.0 | kcal/mol | IMRE | Bartmess, Scott, et al., 1979 | gas phase; value altered from reference due to change in acidity scale; B |

References

Swarts, 1919
Swarts, F.,
Etudes thermochimiques sur les combinaisons organiques fluorees,
J. Chim. Phys., 1919, 17, 3-70. [all data]
Lichanot, 1991
Lichanot, A.,
Heat capacities of fluroaniline, fluorophenol and difluorobenzene in condensed phase,
Thermochim. Acta, 1991, 177, 265-272. [all data]
PCR Inc., 1990
PCR Inc.,
Research Chemicals Catalog 1990-1991, PCR Inc., Gainesville, FL, 1990, 1. [all data]
Popp, 1964
Popp, F.D.,
Some Derivatives of 3-Bromobenzaldehyde,
J. Chem. Eng. Data, 1964, 9, 381. [all data]
Ribeiro da Silva, Ferreira, et al., 2007
Ribeiro da Silva, Manuel A.V.; Ferreira, Ana I.M.C.L.; Gomes, José R.B.,
Combined Experimental and Computational Study of the Thermochemistry of the Fluoroaniline Isomers,
J. Phys. Chem. B, 2007, 111, 8, 2052-2061, https://doi.org/10.1021/jp0672407
. [all data]
Aldrich Chemical Company Inc., 1990
Aldrich Chemical Company Inc.,
Catalog Handbook of Fine Chemicals, Aldrich Chemical Company, Inc., Milwaukee WI, 1990, 1. [all data]
Weast and Grasselli, 1989
CRC Handbook of Data on Organic Compounds, 2nd Editon, Weast,R.C and Grasselli, J.G., ed(s)., CRC Press, Inc., Boca Raton, FL, 1989, 1. [all data]
Bartmess, Scott, et al., 1979
Bartmess, J.E.; Scott, J.A.; McIver, R.T., Jr.,
The gas phase acidity scale from methanol to phenol,
J. Am. Chem. Soc., 1979, 101, 6047. [all data]