2,2-Dichlorotrifluoroethyl chlorodifluoromethyl ether
- Formula: C3Cl3F5O
- Molecular weight: 253.383
- IUPAC Standard InChIKey: LWQARWCIQAGKRZ-UHFFFAOYSA-N
- CAS Registry Number: 37136-24-6
- Chemical structure:
View 3d structure (requires JavaScript / HTML 5) - Permanent link for this species. Use this link for bookmarking this species for future reference.

Gas phase thermochemistry data

Data compiled by: Hussein Y. Afeefy, Joel F. Liebman, and Stephen E. Stein
Quantity | Value | Units | Method | Reference | Comment |
---|---|---|---|---|---|
ΔfH°gas | -1325.8 ± 7.3 | kJ/mol | Ccr | Kolesov, Erastov, et al., 1981 | Reanalyzed by Kolesov and Kozina, 1986, Original value = -1327. ± 7.1 kJ/mol |

Condensed phase thermochemistry data

Data compiled by: Hussein Y. Afeefy, Joel F. Liebman, and Stephen E. Stein
Quantity | Value | Units | Method | Reference | Comment |
---|---|---|---|---|---|
ΔfH°liquid | -1361. ± 7.1 | kJ/mol | Ccr | Kolesov, Erastov, et al., 1981 | |
Quantity | Value | Units | Method | Reference | Comment |
ΔcH°liquid | -787.4 ± 7.1 | kJ/mol | Ccr | Kolesov, Erastov, et al., 1981 |

Phase change data

Data compiled by: William E. Acree, Jr., James S. Chickos
Quantity | Value | Units | Method | Reference | Comment |
---|---|---|---|---|---|
ΔvapH° | 33.8 ± 0.5 | kJ/mol | EB | Ammar, Bulgakova, et al., 1976 |
Enthalpy of vaporization
ΔvapH (kJ/mol) | Temperature (K) | Method | Reference | Comment |
---|---|---|---|---|
33.4 | 317. | A | Stephenson and Malanowski, 1987 | Based on data from 302. to 350. K. |

References

Kolesov, Erastov, et al., 1981
Kolesov, V.P.; Erastov, P.A.; Bondarenko, K.K.,
Standard enthalpies of formation of certain halogenoethers,
Russ. J. Phys. Chem. (Engl. Transl.), 1981, 55, 803-805. [all data]
Kolesov and Kozina, 1986
Kolesov, V.P.; Kozina, M.P.,
Thermochemistry of organic and organohalogen compounds,
Russ. Chem. Rev., 1986, 55, 912. [all data]
Ammar, Bulgakova, et al., 1976
Ammar, M.M.; Bulgakova, L.L.; Varushchenko, R.M.,
Russ. J. Phys. Chem., 1976, 50, 1466. [all data]
Stephenson and Malanowski, 1987
Stephenson, Richard M.; Malanowski, Stanislaw,
Handbook of the Thermodynamics of Organic Compounds, 1987, https://doi.org/10.1007/978-94-009-3173-2
. [all data]