7-Hydroxyheptanoic acid

Reaction thermochemistry data

Data compiled by: Hussein Y. Afeefy, Joel F. Liebman, and Stephen E. Stein

Individual Reactions

7-Hydroxyheptanoic acid = Heptanolactone + Water

By formula: C7H14O3 = C7H12O2 + H2O

Quantity Value Units Method Reference Comment
Δr30.2 ± 0.2kJ/molCmWiberg and Waldron, 1991solid phase

Condensed phase thermochemistry data

Data compiled by: Hussein Y. Afeefy, Joel F. Liebman, and Stephen E. Stein

Quantity Value Units Method Reference Comment
Δfsolid-808. ± 3.kJ/molCmWiberg and Waldron, 1991

References

Wiberg and Waldron, 1991
Wiberg, K.B.; Waldron, R.F., Lactones. 2. Enthalpies of hydrolysis, reduction, and formation of the C4-C13 monocyclic lactones. strain energies and conformations, J. Am. Chem. Soc., 1991, 113, 7697-7705. [all data]