3-Octyne, 7-methyl-
- Formula: C9H16
- Molecular weight: 124.2233
- IUPAC Standard InChIKey: ZDXUMWBWHSCWBK-UHFFFAOYSA-N
- CAS Registry Number: 37050-06-9
- Chemical structure:
View 3d structure (requires JavaScript / HTML 5) - Other names: 7-Methyl-3-octyne

Phase change data

Data compiled by: Robert L. Brown and Stephen E. Stein
Reduced pressure boiling point
Tboil (K) | Pressure (bar) | Reference |
---|---|---|
360. | 0.13 | Farchan Laboratories, 1990 |

References

Farchan Laboratories, 1990
Farchan Laboratories,
Research Chemicals Catalog, Farchan Laboratories, Gainesville, FL, 1990, 91. [all data]