1-(2-Hydroxyethyl)-2-imidazolidinone
- Formula: C5H10N2O2
- Molecular weight: 130.1451
- IUPAC Standard InChIKey: HBAIZGPCSAAFSU-UHFFFAOYSA-N
- CAS Registry Number: 3699-54-5
- Chemical structure:
View 3d structure (requires JavaScript / HTML 5) - Other names: 2-Imidazolidinone, 1-(2-hydroxyethyl)-; Hydroxyethylethyleneurea; 1-(2-hydroxyethyl)imidazolidin-2-one

Phase change data

Data compiled by: Robert L. Brown and Stephen E. Stein
Reduced pressure boiling point
Tboil (K) | Pressure (bar) | Reference |
---|---|---|
458. | 0.0047 | Frinton Laboratories Inc., 1986 |

References

Frinton Laboratories Inc., 1986
Frinton Laboratories Inc.,
Catalog Number 11, Frinton Laboratories Inc., Vineland, NJ, 1986, 99. [all data]