Aniline, 2,3,4,6-tetranitro-
- Formula: C6H3N5O8
- Molecular weight: 273.1167
- IUPAC Standard InChIKey: UKUDSMQEWVNCOJ-UHFFFAOYSA-N
- CAS Registry Number: 3698-54-2
- Chemical structure:
View 3d structure (requires JavaScript / HTML 5) - Permanent link for this species. Use this link for bookmarking this species for future reference.

Condensed phase thermochemistry data

Data compiled by: Hussein Y. Afeefy, Joel F. Liebman, and Stephen E. Stein
Quantity | Value | Units | Method | Reference | Comment |
---|---|---|---|---|---|
ΔfH°solid | -49.12 | kJ/mol | Ccb | Rinkenbach, 1930 | Author hf298_condensed[kcal/mol]=-13.96 |
Quantity | Value | Units | Method | Reference | Comment |
ΔcH°solid | -2740.7 | kJ/mol | Ccb | Rinkenbach, 1930 | Author hf298_condensed[kcal/mol]=-13.96 |

References

Rinkenbach, 1930
Rinkenbach, W.H.,
The heats of combustion and formation of aromatic nitro compounds,
J. Am. Chem. Soc., 1930, 52, 115-120. [all data]