Chrysene, 5,6-dimethyl-
- Formula: C20H16
- Molecular weight: 256.3410
- IUPAC Standard InChIKey: SDOJHDGZFOGOFD-UHFFFAOYSA-N
- CAS Registry Number: 3697-27-6
- Chemical structure:
View 3d structure (requires JavaScript / HTML 5) - Permanent link for this species. Use this link for bookmarking this species for future reference.

Gas phase thermochemistry data

Data compiled by: Hussein Y. Afeefy, Joel F. Liebman, and Stephen E. Stein
Quantity | Value | Units | Method | Reference | Comment |
---|---|---|---|---|---|
ΔfH°gas | 262. | kJ/mol | Ccb | Geiseler, Quitzsch, et al., 1966 |

Condensed phase thermochemistry data

Data compiled by: Hussein Y. Afeefy, Joel F. Liebman, and Stephen E. Stein
Quantity | Value | Units | Method | Reference | Comment |
---|---|---|---|---|---|
ΔcH°solid | -10289. | kJ/mol | Ccb | Geiseler, Quitzsch, et al., 1966 | Corresponding ΔfHºsolid = 133. kJ/mol (simple calculation by NIST; no Washburn corrections) |

Phase change data

Data compiled as indicated in comments:
TRC - Thermodynamics Research Center, NIST Boulder Laboratories, Chris Muzny director
AC - William E. Acree, Jr., James S. Chickos
ALS - Hussein Y. Afeefy, Joel F. Liebman, and Stephen E. Stein
Quantity | Value | Units | Method | Reference | Comment |
---|---|---|---|---|---|
Tfus | 402.4 | K | N/A | Newman, 1940 | Uncertainty assigned by TRC = 2.5 K; TRC |
Quantity | Value | Units | Method | Reference | Comment |
ΔsubH° | 130.0 | kJ/mol | V | Geiseler, Quitzsch, et al., 1966 | ALS |
Enthalpy of vaporization
ΔvapH (kJ/mol) | Temperature (K) | Method | Reference | Comment |
---|---|---|---|---|
121.7 | 387. | A | Stephenson and Malanowski, 1987 | Based on data from 380. to 394. K.; AC |
Enthalpy of sublimation
ΔsubH (kJ/mol) | Temperature (K) | Method | Reference | Comment |
---|---|---|---|---|
135. ± 2.4 | 394. | ME | Kelley and Rice, 1964 | Based on data from 379. to 408. K.; AC |

References

Geiseler, Quitzsch, et al., 1966
Geiseler, V.G.; Quitzsch, K.; Rauh, H.J.; Schaffernicht, H.; Walther, H.J.,
Bildungsenthalpien und Mesomerieenergien von π-Bindungssystemen 1. Mitteilung: Bildungsenthalpien und Mesomerieenergien einiger mehrkerniger Aromaten und verschiedener Pseudoazulene,
Ber. Bunsen-Ges. Phys. Chem., 1966, 70, 551-556. [all data]
Newman, 1940
Newman, M.S.,
The Synthesis of 5-Methylchyrsene and Related Compounds,
J. Am. Chem. Soc., 1940, 62, 870. [all data]
Stephenson and Malanowski, 1987
Stephenson, Richard M.; Malanowski, Stanislaw,
Handbook of the Thermodynamics of Organic Compounds, 1987, https://doi.org/10.1007/978-94-009-3173-2
. [all data]
Kelley and Rice, 1964
Kelley, J. Daniel; Rice, Francis Owen,
The Vapor Pressures of Some Polynuclear Aromatic Hydrocarbons 1,
J. Phys. Chem., 1964, 68, 12, 3794-3796, https://doi.org/10.1021/j100794a043
. [all data]