3-[(trifluoromethyl)thio]aniline

Reaction thermochemistry data

Data compiled by: John E. Bartmess

Individual Reactions

C7H5F3NS- + Hydrogen cation = C7H6F3NS

By formula: C7H5F3NS- + H+ = C7H6F3NS

Quantity Value Units Method Reference Comment
Δr355.3 ± 2.1kcal/molG+TSTaft and Topsom, 1987gas phase
Quantity Value Units Method Reference Comment
Δr348.0 ± 2.0kcal/molIMRETaft and Topsom, 1987gas phase

Gas phase ion energetics data

Data compiled by: John E. Bartmess

De-protonation reactions

C7H5F3NS- + Hydrogen cation = C7H6F3NS

By formula: C7H5F3NS- + H+ = C7H6F3NS

Quantity Value Units Method Reference Comment
Δr355.3 ± 2.1kcal/molG+TSTaft and Topsom, 1987gas phase
Quantity Value Units Method Reference Comment
Δr348.0 ± 2.0kcal/molIMRETaft and Topsom, 1987gas phase

References

Taft and Topsom, 1987
Taft, R.W.; Topsom, R.D., The Nature and Analysis of Substituent Effects, Prog. Phys. Org. Chem., 1987, 16, 1. [all data]