L-Alanine, N-glycyl-
- Formula: C5H10N2O3
- Molecular weight: 146.1445
- IUPAC Standard InChIKey: VPZXBVLAVMBEQI-GSVOUGTGSA-N
- CAS Registry Number: 3695-73-6
- Chemical structure:
View 3d structure (requires JavaScript / HTML 5) - Stereoisomers:
- Other names: Alanine, N-glycyl-, L-; Gly-ala; Glycine-α-alanine; Glycine-alanine dipeptide; Glycyl-L-alanine; Glycylalanine; N-Glycyl-L-alanine; N-(Aminoacetyl)alanine, L-; NSC 83246; N-glycylalanine

Reaction thermochemistry data

Data compiled by: Robert C. Dunbar
Individual Reactions
By formula: Na+ + C5H10N2O3 = (Na+ • C5H10N2O3)
Free energy of reaction
ΔrG° (kJ/mol) | T (K) | Method | Reference |
---|---|---|---|
149. | 0. | CIDC | Feng, Gronert, et al., 1999 |

Gas phase ion energetics data

Data compiled by: Michael M. Meot-Ner (Mautner)
Gas basicity at 298K
Gas basicity (review) (kJ/mol) | Reference | Comment |
---|---|---|
888.0 ± 1.2 | Bouchoux and Salpin, 2003 | T = 298K |
889.1 ± 6.3 | Cassady, Carr, et al., 1995 | T = 298K; GB> 4-acetylpyridine, ≈isopropylamine, < sec-butylamine |

Ion clustering data

Data compiled by: Robert C. Dunbar
Clustering reactions
By formula: Na+ + C5H10N2O3 = (Na+ • C5H10N2O3)
Free energy of reaction
ΔrG° (kJ/mol) | T (K) | Method | Reference |
---|---|---|---|
149. | 0. | CIDC | Feng, Gronert, et al., 1999 |

References

Feng, Gronert, et al., 1999
Feng, W.Y.; Gronert, S.; Lebrilla, C.B.,
Lithium and sodium ion binding energies of N-acetyl and N-glycyl amino acids,
J. Am. Chem. Soc., 1999, 121, 6, 1365, https://doi.org/10.1021/ja983116s
. [all data]
Bouchoux and Salpin, 2003
Bouchoux, G.; Salpin, J.Y.,
Gas-phase basicity of glycine, alanine, proline, serine, lysine, histidine and some of their peptides by the thermokinetic method,
European J. Mass Spectrometry, 2003, 9, 391-402. [all data]
Cassady, Carr, et al., 1995
Cassady, C.J.; Carr, S.R.; Zhang, K.; Chung-Phillips, C.,
Experimental and Ab Intio Studies of Protonations of Alanine and Samll Peptides of Alanine and Glycine,
J. Org. Chem., 1995, 60, 1704. [all data]