α-Guaiene
- Formula: C15H24
- Molecular weight: 204.3511
- IUPAC Standard InChIKey: ADIDQIZBYUABQK-UPJWGTAASA-N
- CAS Registry Number: 3691-12-1
- Chemical structure:
View 3d structure (requires JavaScript / HTML 5) - Other names: Azulene, 1,2,3,4,5,6,7,8-octahydro-1,4-dimethyl-7-(1-methylethenyl)-, [1S-(1α,4α,7α)]-; (1S,4S,7R)-1,4-Dimethyl-7-(prop-1-en-2-yl)-1,2,3,4,5,6,7,8-octahydroazulene; Guaia-1(5),11-diene; 7-Isopropenyl-1,4-dimethyl-1,2,3,4,5,6,7,8-octahydroazulene-, [1S-(1α,4α,7α)]-; Azulene, 1,2,3,4,5,6,7,8-octahydro-1,4-dimethyl-7-(1-methylethenyl)-, (1S,4S,7R)-; (Z)-β-Guaiene; α-Guajene; α-quaiene; α-Guaiaene; β-Guaiene, cis-

Kovats' RI, non-polar column, temperature ramp

Column type | Active phase | I | Reference | Comment |
---|---|---|---|---|
Capillary | DB-5 | 1438. | Sylvestre, Pichette, et al., 2006 | 30. m/0.25 mm/0.25 μm, 40. C @ 2. min, 2. K/min, 210. C @ 33. min |
Capillary | DB-5 | 1440. | Medina, Lucero, et al., 2005 | 30. m/0.25 mm/0.25 μm, Helium, 3. K/min; Tstart: 60. C; Tend: 255. C |
Capillary | DB-5 | 1439. | Shatar S., 2005 | 3. K/min; Tstart: 60. C; Tend: 240. C |
Capillary | CP Sil 5 CB | 1442. | Ogunwande, Olawore, et al., 2004 | 25. m/0.25 mm/0.15 μm, H2, 3. K/min; Tstart: 50. C; Tend: 230. C |
Capillary | HP-5 | 1457. | Bouzouita, Kachouri, et al., 2003 | 30. m/0.25 mm/1. μm, He, 40. C @ 1. min, 5. K/min; Tend: 250. C |
Capillary | DB-5 | 1439. | Viña and Murillo, 2003 | 30. m/0.25 mm/0.25 μm, He, 50. C @ 5. min, 0.5 K/min, 250. C @ 10. min |
Capillary | DB-5 | 1452. | Buchin, Salmon, et al., 2002 | 60. m/0.32 mm/1. μm, He, 40. C @ 5. min, 3. K/min, 230. C @ 2. min |
Capillary | HP-5 | 1440. | Juliani and Simon, 2002 | 30. m/0.25 mm/0.25 μm, He, 60. C @ 1. min, 4. K/min, 200. C @ 15. min |
Capillary | BP-1 | 1451. | Raina, Srivastava, et al., 2002 | 25. m/0.55 mm/0.25 μm, N2, 5. K/min, 220. C @ 15. min; Tstart: 60. C |
Capillary | SPB-1 | 1441. | John, Rao, et al., 1999 | 30. m/0.32 mm/0.25 μm, He, 50. C @ 3. min, 2. K/min, 250. C @ 5. min |
Capillary | HP-5MS | 1433. | Siani, Ramos, et al., 1999 | 30. m/0.32 mm/0.25 μm, He, 70. C @ 5. min, 3. K/min; Tend: 250. C |
Capillary | DB-5 | 1443. | da Silva, Andrade, et al., 1999 | 30. m/0.25 mm/0.25 μm, He, 3. K/min; Tstart: 60. C; Tend: 240. C |
Capillary | DB-5 | 1428. | Senatore, Urrunaga Soria, et al., 1998 | 30. m/0.25 mm/0.25 μm, He, 40. C @ 5. min, 2. K/min, 250. C @ 20. min |
Capillary | SE-30 | 1455. | Jantan, Ahmad, et al., 1996 | N2, 60. C @ 10. min, 3. K/min, 180. C @ 1. min; Column length: 25. m; Column diameter: 0.2 mm |
Capillary | SE-30 | 1455. | Jantan, Ali, et al., 1995 | N2, 60. C @ 10. min, 3. K/min, 180. C @ 1. min; Column length: 25. m; Column diameter: 0.2 mm |

Kovats' RI, non-polar column, custom temperature program

Column type | Active phase | I | Reference | Comment |
---|---|---|---|---|
Capillary | HP-5 | 1439. | Shellie and Marriott, 2003 | 30. m/0.25 mm/0.25 μm, He; Program: not specified |

Kovats' RI, polar column, temperature ramp

Column type | Active phase | I | Reference | Comment |
---|---|---|---|---|
Capillary | Supelcowax-10 | 1589. | Sylvestre, Pichette, et al., 2006 | 30. m/0.25 mm/0.25 μm, 40. C @ 2. min, 2. K/min, 210. C @ 33. min |
Capillary | Innowax | 1600. | Viña and Murillo, 2003 | 30. m/0.25 mm/0.25 μm, He, 50. C @ 5. min, 0.5 K/min, 250. C @ 10. min |

Van Den Dool and Kratz RI, non-polar column, temperature ramp

Column type | Active phase | I | Reference | Comment |
---|---|---|---|---|
Capillary | DB-5 | 1490. | Silva, Barbosa, et al., 2007 | 30. m/0.22 mm/0.25 μm, He, 55. C @ 2. min, 3. K/min, 240. C @ 15. min |
Capillary | HP-5MS | 1413. | Basta, Tzakou, et al., 2006 | 30. m/0.25 mm/0.25 μm, He, 3. K/min; Tstart: 60. C; Tend: 280. C |
Capillary | RTX-1 | 1436. | Cavalli, Tomi, et al., 2006 | 60. m/0.22 mm/0.25 μm, He, 2. K/min, 230. C @ 45. min; Tstart: 60. C |
Capillary | HP-5MS | 1409. | Pavlovic, Kovacevic, et al., 2006 | 30. m/0.25 mm/0.25 μm, He, 3. K/min; Tstart: 60. C; Tend: 280. C |
Capillary | HP-5MS | 1439. | Silva-Brandão, Solferini, et al., 2006 | 30. m/0.25 mm/0.25 μm, He, 3. K/min; Tstart: 60. C; Tend: 300. C |
Capillary | CP Sil 5 CB | 1440. | Ziegenbein, Hanssen, et al., 2006 | 25. m/0.25 mm/0.4 μm, He, 10. K/min; Tstart: 80. C; Tend: 270. C |
Capillary | HP-5 | 1440. | Celik, Gokturk, et al., 2005 | 30. m/0.25 mm/0.25 μm, N2, 60. C @ 10. min, 5. K/min; Tend: 220. C |
Capillary | DB-1 | 1437. | Dob, Berramdane, et al., 2005 | 30. m/0.32 mm/0.25 μm, N2, 50. C @ 3. min, 2. K/min, 260. C @ 5. min |
Capillary | HP-5 | 1440. | Flamini, Luigi Cioni, et al., 2005 | 30. m/0.25 mm/0.25 μm, N2, 60. C @ 10. min, 5. K/min; Tend: 220. C |
Capillary | HP-5MS | 1439. | Pino, Mesa, et al., 2005 | 30. m/0.25 mm/0.25 μm, He, 60. C @ 2. min, 4. K/min, 250. C @ 20. min |
Capillary | DB-1 | 1428. | Tchoumbougnang, Zollo, et al., 2005 | 30. m/0.25 mm/0.25 μm, N2, 5. K/min; Tstart: 50. C; Tend: 200. C |
Capillary | SPB-1 | 1428. | Antunes, Sevinate-Pinto, et al., 2004 | 30. m/0.25 mm/0.25 μm, He, 3. K/min, 220. C @ 15. min; Tstart: 70. C |
Capillary | HP-1 | 1418. | Fernández-Ocaña, Gómez-Rodríguez, et al., 2004 | 25. m/0.32 mm/0.17 μm, He, 3. K/min; Tstart: 50. C; Tend: 200. C |
Capillary | DB-5 | 1440. | Flamini, Cioni, et al., 2004 | 30. m/0.25 mm/0.25 μm, N2, 3. K/min; Tstart: 60. C; Tend: 240. C |
Capillary | DB-5 | 1440. | Flamini, Cioni, et al., 2004 | 30. m/0.25 mm/0.25 μm, N2, 3. K/min; Tstart: 60. C; Tend: 240. C |
Capillary | HP-5 | 1441. | Flach A., Dondon R.C., et al., 2004 | 30. m/0.25 mm/0.25 μm, He, 4. K/min; Tstart: 50. C; Tend: 290. C |
Capillary | HP-5MS | 1426. | Karioti, Hadjipavlou-Litina, et al., 2004 | 30. m/0.25 mm/0.25 μm, He, 60. C @ 5. min, 4. K/min; Tend: 280. C |
Capillary | HP-5 | 1438. | Sartoratto, Machado, et al., 2004 | 25. m/0.2 mm/0.33 μm, He, 3. K/min, 240. C @ 7. min; Tstart: 60. C |
Capillary | HP-5 | 1440. | Flamini, Luigi Cioni, et al., 2003 | 30. m/0.25 mm/0.25 μm, N2, 60. C @ 10. min, 5. K/min; Tend: 220. C |
Capillary | DB-5 | 1489. | Högnadóttir and Rouseff, 2003 | 30. m/0.32 mm/0.5 μm, 7. K/min, 265. C @ 5. min; Tstart: 40. C |
Capillary | HP-5 | 1439. | Karioti, Skaltsa, et al., 2003 | 30. m/0.25 mm/0.25 μm, He, 60. C @ 5. min, 4. K/min; Tend: 280. C |
Capillary | HP-5 | 1440. | Macchioni, Cioni, et al., 2003 | 30. m/0.25 mm/0.25 μm, He, 3. K/min; Tstart: 60. C; Tend: 240. C |
Capillary | HP-5MS | 1439. | Salido, Altarejos, et al., 2003 | 30. m/0.25 mm/0.25 μm, He, 3. K/min; Tstart: 50. C; Tend: 250. C |
Capillary | HP-5 | 1445. | Shellie and Marriott, 2003 | 30. m/0.25 mm/0.25 μm, He, 3. K/min; Tstart: 40. C; Tend: 240. C |
Capillary | HP-5MS | 1439. | Demetzos, Angelopoulou, et al., 2002 | 30. m/0.25 mm/0.25 μm, 50. C @ 5. min, 3. K/min; Tend: 280. C |
Capillary | HP-5 | 1440. | Flamini, Cioni, et al., 2002 | 30. m/0.25 mm/0.25 μm, N2, 60. C @ 10. min, 5. K/min; Tend: 220. C |
Capillary | HP-5 | 1438. | Fokialakis, Magiatis, et al., 2002 | 30. m/0.25 mm/0.25 μm, 60. C @ 5. min, 3. K/min; Tend: 280. C |
Capillary | DB-1 | 1455. | bin Jantan and bin Ahmad, 2002 | N2, 60. C @ 10. min, 3. K/min, 180. C @ 10. min; Column length: 25. m; Column diameter: 0.25 mm |
Capillary | DB-5 | 1441. | Javidnia, Miri, et al., 2002 | 30. m/0.25 mm/0.25 μm, He, 4. K/min; Tstart: 60. C; Tend: 260. C |
Capillary | HP-5 | 1435. | Kovacevic, Pavlovic, et al., 2002 | 30. m/0.25 mm/0.25 μm, He, 3. K/min; Tstart: 60. C; Tend: 280. C |
Capillary | RTX-5 | 1438. | Mondello, Zappia, et al., 2002 | 30. m/0.25 mm/0.25 μm, He, 45. C @ 6. min, 3. K/min, 300. C @ 10. min |
Capillary | HP-5 | 1429. | Couladis, Tsortanidou, et al., 2001 | 30. m/0.25 mm/0.25 μm, He, 3. K/min; Tstart: 60. C; Tend: 380. C |
Capillary | RTX-5 MS | 1456. | Hudaib, Grazia Bellardi, et al., 2001 | 30. m/0.25 mm/0.25 μm, He, 70. C @ 10. min, 4. K/min, 210. C @ 10. min |
Capillary | HP-5MS | 1439. | Skaltsa, Mavrommati, et al., 2001 | 30. m/0.25 mm/0.25 μm, He, 60. C @ 5. min, 4. K/min; Tend: 280. C |
Capillary | DB-5 | 1458. | Bartley and Jacobs, 2000 | 60. m/0.25 mm/0.25 μm, He, 40. C @ 2. min, 4. K/min, 290. C @ 5. min |
Capillary | DB-5 | 1442. | Maia, de Paula, et al., 2000 | 30. m/0.25 mm/0.25 μm, He, 60. C @ 2. min, 3. K/min; Tend: 240. C |
Capillary | DB-5 | 1442. | Maia, de Paula, et al., 2000 | 30. m/0.25 mm/0.25 μm, He, 60. C @ 2. min, 3. K/min; Tend: 240. C |
Capillary | Mega 5MS | 1418. | Verzera, Trozzi, et al., 2000 | 30. m/0.25 mm/0.25 μm, He, 40. C @ 2. min, 3. K/min; Tend: 240. C |
Capillary | DB-5 | 1440. | Sagrero-Nieves, Bartley, et al., 1997 | 30. m/0.26 mm/0.25 μm, He, 2. K/min, 225. C @ 20. min; Tstart: 50. C |
Capillary | DB-1 | 1447. | Stashenko, Wiame, et al., 1995 | 30. m/0.20 mm/0.20 μm, He, 70. C @ 5. min, 4. K/min; Tend: 200. C |

Van Den Dool and Kratz RI, non-polar column, custom temperature program

Column type | Active phase | I | Reference | Comment |
---|---|---|---|---|
Capillary | DB-5 | 1441. | Andrade, Sampaio, et al., 2007 | 30. m/0.25 mm/0.25 μm, He; Program: 40C(2min) => 4C/min => 220C => 20C/min => 280C |
Capillary | CBP-5 | 1439. | Silva, Oliveira, et al., 2007 | 30. m/0.25 mm/0.25 μm, He; Program: 60C => 3C/min => 246C => 10C/min => 270C (5min) |
Capillary | BPX-5 | 1446. | Cardeal, da Silva, et al., 2006 | 30. m/0.25 mm/0.25 μm; Program: 35C(5min) => 3C/min => 210C => 40C/min => 240C (4min) |
Capillary | DB-5 | 1453. | Özel, Gögüs, et al., 2006 | Program: not specified |
Capillary | SE-52 | 1429. | Lorenzo, Paz, et al., 2005 | 25. m/0.32 mm/0.43 μm, H2; Program: 60C(8min) => 3C/min => 180C => 20C/min => 250C(10min) |
Capillary | SPB-1 | 1444. | Díaz-Maroto, Sánchez Palomo, et al., 2004 | 50. m/0.25 mm/0.25 μm; Program: 70C(3min) => 4C/min => 120C => 8C/min => 250C |
Capillary | HP-5 | 1489. | Isidorov, Krajewska, et al., 2000 | 30. m/0.25 mm/0.25 μm; Program: 40C(1min) => 3C/min => 120C => 5C/min => 280C |

Van Den Dool and Kratz RI, polar column, temperature ramp

Column type | Active phase | I | Reference | Comment |
---|---|---|---|---|
Capillary | RTX-Wax | 1591. | Cavalli, Tomi, et al., 2006 | 60. m/0.22 mm/0.25 μm, He, 2. K/min, 230. C @ 45. min; Tstart: 60. C |
Capillary | DB-Wax | 1650. | Bartley and Jacobs, 2000 | 60. m/0.5 mm/0.32 μm, He, 40. C @ 2. min, 4. K/min, 290. C @ 5. min |
Capillary | DB-Wax | 1652. | Stashenko, Wiame, et al., 1995 | 60. m/0.20 mm/0.20 μm, He, 70. C @ 5. min, 2. K/min; Tend: 180. C |

Normal alkane RI, non-polar column, isothermal

Column type | Active phase | Temperature (C) | I | Reference | Comment |
---|---|---|---|---|---|
Capillary | DB-5 | 25. | 1439. | Hemmateenejad, Jawadnia, et al., 2007 |

Normal alkane RI, non-polar column, temperature ramp

Column type | Active phase | I | Reference | Comment |
---|---|---|---|---|
Capillary | DP-5 | 1490. | Vijayakumar, Duraipandiyan, et al., 2012 | 30. m/0.25 mm/0.25 μm, Helium, 80. C @ 1. min, 4. K/min, 300. C @ 40. min |
Capillary | HP-5 MS | 1424. | Hammami, Kamoun, et al., 2011 | 30. m/0.25 mm/0.25 μm, Helium, 2. K/min; Tstart: 50. C; Tend: 180. C |
Capillary | HP-5 | 1439. | Kahriman, Tosun, et al., 2011 | 30. m/0.32 mm/0.25 μm, Helium, 60. C @ 2. min, 3. K/min; Tend: 240. C |
Capillary | RTX-5 | 1437. | Prasad, Moulekhi, et al., 2011 | 30. m/0.32 mm/0.25 μm, Nitrogen, 3. K/min; Tstart: 60. C; Tend: 210. C |
Capillary | OV-1 | 1435. | Hu, Liang, et al., 2010 | 30. m/0.25 mm/0.25 μm, Helium, 50. C @ 3. min, 5. K/min, 250. C @ 2. min |
Capillary | HP-5 | 1438. | Kahriman, Tosun, et al., 2010 | 30. m/0.32 mm/0.25 μm, Helium, 60. C @ 2. min, 3. K/min; Tend: 240. C |
Capillary | DB-5 MS | 1442. | Mesa-Arango, Betancur-Galvis, et al., 2010 | 60. m/0.25 mm/0.25 μm, Helium, 40. C @ 15. min, 5. K/min, 250. C @ 15. min |
Capillary | DB-5 MS | 1433. | Silva, Pott, et al., 2010 | 30. m/0.25 mm/0.25 μm, Helium, 3. K/min; Tstart: 60. C; Tend: 240. C |
Capillary | DB-1 | 1433. | Xu, Tang, et al., 2010 | 30. m/0.25 mm/0.25 μm, Helium, 50. C @ 2. min, 4. K/min, 220. C @ 2. min |
Capillary | CP-Sil 5 CB | 1444. | Hnawia, Menut, et al., 2009 | 30. m/0.25 mm/0.25 μm, Nitrogen, 5. K/min; Tstart: 50. C; Tend: 200. C |
Capillary | DB-5 | 1440. | Ho, Wang, et al., 2009 | 30. m/0.25 mm/0.25 μm, Helium, 50. C @ 2. min, 5. K/min; Tend: 250. C |
Capillary | HP-5 | 1438. | Maridass, 2009 | 25. m/0.20 mm/0.33 μm, Helium, 3. K/min, 240. C @ 7. min; Tstart: 60. C |
Capillary | 5 % Phenyl methyl siloxane | 1437. | Retta, Gattuso, et al., 2009 | 60. m/0.25 mm/0.25 μm, Helium, 3. K/min, 225. C @ 3. min; Tstart: 90. C |
Capillary | DB-5 | 1419. | Khokra, Prakash, et al., 2008 | 30. m/0.25 mm/0.25 μm, Helium, 100. C @ 2. min, 20. K/min, 300. C @ 10. min |
Capillary | DB-5 | 1420. | Khokra, Prakash, et al., 2008 | 30. m/0.25 mm/0.25 μm, Helium, 100. C @ 2. min, 20. K/min, 300. C @ 10. min |
Capillary | VF-5MS | 1444. | Kowalski, 2008 | 30. m/0.25 mm/0.25 μm, Helium, 240. C @ 1. min, 20. K/min; Tend: 320. C |
Capillary | BPX-5 | 1450. | Shellie, 2008 | 7.5 m/0.10 mm/10. μm, Helium, 3. K/min; Tstart: 60. C; Tend: 240. C |
Capillary | DB-5MS | 1439. | Andrade, Oliveira, et al., 2007 | 30. m/0.25 mm/0.25 μm, He, 3. K/min; Tstart: 60. C; Tend: 240. C |
Capillary | HP-5MS | 1427. | Basta, Pavlovic, et al., 2007 | 30. m/0.25 mm/0.25 μm, He, 3. K/min; Tstart: 60. C; Tend: 280. C |
Capillary | HP-5 | 1441. | Farsam, Amanlou, et al., 2007 | 30. m/0.25 mm/0.26 μm, Helium, 60. C @ 2. min, 4. K/min, 240. C @ 20. min |
Capillary | HP-1 | 1429. | Hachicha, Skanji, et al., 2007 | 30. m/0.25 mm/0.25 μm, He, 2. K/min, 240. C @ 20. min; Tstart: 60. C |
Capillary | SPB-5 | 1444. | Raal, Orav, et al., 2007 | 30. m/0.25 mm/0.25 μm, He, 2. K/min; Tstart: 50. C; Tend: 250. C |
Capillary | HP-5 | 1445. | Bertrand, Comte, et al., 2006 | 60. m/0.25 mm/0.25 μm, He, 3. K/min; Tstart: 60. C; Tend: 250. C |
Capillary | HP-5MS | 1438. | Bozin, Mimicá-Dukic, et al., 2006 | 30. m/0.25 mm/0.25 μm, He, 3. K/min; Tstart: 60. C; Tend: 280. C |
Capillary | CP Sil 5 CB | 1440. | Hymete, Rohloff, et al., 2006 | 30. m/0.25 mm/0.25 μm, 3. K/min, 220. C @ 3. min; Tstart: 40. C |
Capillary | DB-5 | 1443. | Mirza, Navaei, et al., 2006 | 30. m/0.25 mm/0.25 μm, Helium, 50. C @ 5. min, 3. K/min; Tend: 250. C |
Capillary | DB-5 | 1452. | Nickavar B., Kamalinejad M., et al., 2006 | 30. m/0.25 mm/0.25 μm, 50. C @ 0.5 min, 2.5 K/min; Tend: 265. C |
Capillary | DB-1 | 1480. | Pala-Paul J., Perez-Alonso M.J., et al., 2006 | 50. m/0.25 mm/0.25 μm, N2, 4. K/min; Tstart: 95. C; Tend: 240. C |
Capillary | DB-5 | 1439. | Pino, Marbot, et al., 2006 | 30. m/0.25 mm/0.25 μm, Hydrogen, 70. C @ 4. min, 4. K/min; Tend: 280. C |
Capillary | DB-5 | 1446. | Chagonda and Chalchat, 2005 | 25. m/0.25 mm/0.15 μm, 40. C @ 5. min, 3. K/min; Tend: 220. C |
Capillary | DB-5 | 1440. | Morteza-Semnani and Saeedi, 2005 | 30. m/0.25 mm/0.25 μm, He, 60. C @ 4. min, 4. K/min; Tend: 220. C |
Capillary | DB-1 | 1434. | Pala-Paul, Perez-Alonso, et al., 2005 | 50. m/0.25 mm/0.25 μm, N2, 4. K/min; Tstart: 95. C; Tend: 240. C |
Capillary | RTX-5 MS | 1447. | Pellati, Benvenuti, et al., 2005 | 30. m/0.25 mm/0.25 μm, He, 50. C @ 2. min, 8. K/min, 280. C @ 2. min |
Capillary | HP-5MS | 1440. | Slavkovska, Couladis, et al., 2005 | 30. m/0.25 mm/0.25 μm, He, 3. K/min; Tstart: 60. C; Tend: 280. C |
Capillary | DB-1 | 1430. | Velasco-Negueruela, Pérez-Alonso, et al., 2005 | 50. m/0.25 mm/0.25 μm, N2, 4. K/min; Tstart: 90. C; Tend: 240. C |
Capillary | SE-54 | 1429. | Kilic, Hafizoglu, et al., 2004 | 30. m/0.25 mm/0.25 μm, He, 60. C @ 5. min, 2. K/min; Tend: 260. C |
Capillary | NB-30 | 1434. | Orav, Stulova, et al., 2004 | 50. m/0.2 mm/0.25 μm, He, 2. K/min; Tstart: 50. C; Tend: 250. C |
Capillary | NB-30 | 1434. | Orav, Stulova, et al., 2004 | 50. m/0.2 mm/0.25 μm, He, 2. K/min; Tstart: 50. C; Tend: 250. C |
Capillary | RSL-200 | 1462. | Jirovetz, Buchbauer, et al., 2003 | 30. m/0.32 mm/0.25 μm, H2, 40. C @ 5. min, 6. K/min, 280. C @ 5. min |
Capillary | RSL-200 | 1454. | Jirovetz, Buchbauer, et al., 2003, 2 | 30. m/0.32 mm/0.25 μm, H2, 40. C @ 5. min, 6. K/min, 280. C @ 5. min |
Capillary | DB-5 | 1425. | Marongiu, Porcedda, et al., 2003 | 30. m/0.25 mm/0.25 μm, He, 3. K/min, 280. C @ 30. min; Tstart: 60. C |
Capillary | CP Sil 5 CB | 1428. | Oyedeji, Ekundayo, et al., 2003 | 25. m/0.25 mm/0.15 μm, H2, 3. K/min; Tstart: 50. C; Tend: 230. C |
Capillary | HP-5 | 1423. | Pitarokili, Tzakou, et al., 2003 | 30. m/0.25 mm/0.25 μm, He, 3. K/min; Tstart: 60. C; Tend: 280. C |
Capillary | DB-5 | 1428. | Caredda, Marongiu, et al., 2002 | 30. m/0.25 mm/0.25 μm, He, 3. K/min, 280. C @ 30. min; Tstart: 60. C |
Capillary | RSL-200 | 1453. | Jirovetz, Buchbauer, et al., 2002 | 30. m/0.32 mm/0.25 μm, H2, 40. C @ 5. min, 6. K/min, 280. C @ 5. min |
Capillary | DB-5 | 1442. | Kobaisy, Tellez, et al., 2002 | 30. m/0.25 mm/0.25 μm, He, 3. K/min; Tstart: 60. C; Tend: 240. C |
Capillary | DB-5 | 1446. | Krauze-Baranowska, Mardarowicz, et al., 2002 | 30. m/0.25 mm/0.25 μm, He, 35. C @ 2. min, 3. K/min, 280. C @ 15. min |
Capillary | DB-5 | 1435. | Mahmout, Bessière, et al., 2002 | 25. m/0.23 mm/0.15 μm, N2, 3. K/min; Tstart: 50. C; Tend: 250. C |
Capillary | DB-5MS | 1438. | Maia, Zoghbi, et al., 2002 | 30. m/0.25 mm/0.25 μm, He, 3. K/min; Tstart: 60. C; Tend: 240. C |
Capillary | DB-5MS | 1437. | Zoghbi, Andrade, et al., 2002 | 30. m/0.25 mm/0.25 μm, He, 3. K/min; Tstart: 60. C; Tend: 270. C |
Capillary | DB-5 | 1436. | Santos-Gomes and Fernandes-Ferreira, 2001 | 30. m/0.25 mm/0.25 μm, H2, 3. K/min; Tstart: 60. C; Tend: 285. C |
Capillary | DB-1 | 1440.0 | Santos, Moreira, et al., 2001 | He, 3. K/min; Column length: 30. m; Column diameter: 0.2 mm; Tstart: 60. C; Tend: 240. C |
Capillary | DB-5 | 1437. | Tellez M., Estell R., et al., 2001 | 30. m/0.25 mm/0.25 μm, He, 3. K/min; Tstart: 60. C; Tend: 240. C |
Capillary | DB-1 | 1470. | Hedin, McKibben, et al., 2000 | 30. m/0.32 mm/0.25 μm, 45. C @ 2. min, 15. K/min, 300. C @ 5. min |
Capillary | HP-5 | 1445. | Novak, Novak, et al., 2000 | 30. m/0.25 mm/0.25 μm, He, 40. C @ 5. min, 3. K/min; Tend: 240. C |
Capillary | OV-101 | 1444. | Tamura, Boonbumrung, et al., 2000 | Nitrogen, 40. C @ 10. min, 2. K/min; Column length: 50. m; Column diameter: 0.25 mm; Tend: 200. C |
Capillary | CP Sil 5 CB | 1469. | Bos, Woerdenbag, et al., 1997 | 25. m/0.32 mm/0.25 μm, N2, 4. K/min; Tstart: 50. C; Tend: 290. C |
Capillary | CP Sil 5 CB | 1469. | Bos, Woerdenbag, et al., 1997 | 25. m/0.32 mm/0.25 μm, N2, 4. K/min; Tstart: 50. C; Tend: 290. C |
Capillary | CP Sil 5 CB | 1469. | Bos, Woerdenbag, et al., 1997, 2 | 25. m/0.25 mm/0.25 μm, He, 6. K/min; Tstart: 60. C; Tend: 300. C |
Capillary | DB-5 | 1444. | Elias, Simoneit, et al., 1997 | 30. m/0.25 mm/0.25 μm, He, 65. C @ 2. min, 4. K/min; Tend: 300. C |
Capillary | DB-5 | 1424. | Reverchon, Porta, et al., 1997 | 30. m/0.25 mm/0.25 μm, He, 50. C @ 5. min, 2. K/min; Tend: 250. C |
Capillary | DB-5 | 1440. | Tellez, Estell, et al., 1997 | 30. m/0.25 mm/0.25 μm, Helium, 3. K/min; Tstart: 60. C; Tend: 240. C |
Capillary | OV-101 | 1452. | Chacko, Jayalekshmy, et al., 1996 | 50. m/0.25 mm/0.17 μm, N2, 5. K/min; Tstart: 50. C; Tend: 220. C |
Capillary | OV-101 | 1452. | Orav, Kailas, et al., 1996 | He, 2. K/min; Column length: 50. m; Column diameter: 0.25 mm; Tstart: 50. C; Tend: 250. C |
Capillary | DB-1 | 1453. | Stashenko, Puertas, et al., 1996 | 60. m/0.25 mm/0.25 μm, He, 50. C @ 5. min, 2.5 K/min; Tend: 250. C |
Capillary | Methyl Silicone | 1454. | Gopalakrishnan, Menon, et al., 1993 | 50. m/0.25 mm/0.17 μm, N2, 2. K/min; Tstart: 80. C; Tend: 200. C |
Capillary | Methyl Silicone | 1455. | Gopalakrishnan, Menon, et al., 1993 | 50. m/0.25 mm/0.17 μm, N2, 3. K/min; Tstart: 80. C; Tend: 200. C |
Capillary | Methyl Silicone | 1456. | Mallavarapu, Ramesh, et al., 1993 | 5. K/min; Column length: 25. m; Column diameter: 0.50 mm; Tstart: 60. C; Tend: 220. C |
Capillary | SE-54 | 1433. | Kollmannsberger, Nitz, et al., 1992 | 30. m/0.25 mm/0.25 μm, Hydrogen, 60. C @ 5. min, 2. K/min, 250. C @ 2. min |
Capillary | OV-101 | 1442. | Yang and Sugisawa, 1990 | N2, 2. K/min; Column length: 50. m; Column diameter: 0.25 mm; Tstart: 80. C; Tend: 200. C |
Capillary | OV-101 | 1444. | Yang and Sugisawa, 1990 | N2, 2. K/min; Column length: 50. m; Column diameter: 0.25 mm; Tstart: 80. C; Tend: 200. C |
Capillary | SE-30 | 1454. | Ramaswami, Briscese, et al., 1988 | 50. C @ 2. min, 4. K/min, 240. C @ 10. min; Column length: 30. m |
Capillary | SE-30 | 1454. | Ramaswami, Briscese, et al., 1986 | 50. C @ 2. min, 4. K/min, 240. C @ 10. min; Column length: 30. m |

Normal alkane RI, non-polar column, custom temperature program

Column type | Active phase | I | Reference | Comment |
---|---|---|---|---|
Capillary | 5 % Phenyl polydimethyl siloxane | 1435. | Chaverri, Diaz, et al., 2011 | Program: not specified |
Capillary | HP-5 | 1440. | Kahriman, Tosun, et al., 2011 | 30. m/0.32 mm/0.25 μm, Helium; Program: not specified |
Capillary | 1453. | Karimi, Farmany, et al., 2011 | Program: not specified | |
Capillary | DB-5 | 1459. | Miyazaki, Plotto, et al., 2011 | 60. m/0.25 mm/1.00 μm, Helium; Program: 40 0C 4 0C/min -> 230 0C 100 0C/min -> 260 0C (11.7 min) |
Capillary | HP-5 MS | 1439. | Payo, Colo, et al., 2011 | Program: not specified |
Capillary | HP-5 MS | 1440. | Payo, Colo, et al., 2011 | Program: not specified |
Capillary | HP-5 MS | 1441. | Payo, Colo, et al., 2011 | Program: not specified |
Capillary | HP-5 MS | 1444. | Payo, Colo, et al., 2011 | Program: not specified |
Capillary | HP-5 | 1440. | Kahriman, Tosun, et al., 2010 | 30. m/0.32 mm/0.25 μm, Helium; Program: not specified |
Capillary | DB-1 | 1442. | Xu, Tang, et al., 2010 | 30. m/0.25 mm/0.25 μm, Helium; Program: not specified |
Capillary | DB-5 | 1439. | Courtois, Paine, et al., 2009 | 30. m/0.25 mm/0.25 μm, Helium; Program: 50 0C m6 0C/min -> 140 0C 5 0C/min -> 160 0C (1 min) 10 0C/min -> 200 0C |
Capillary | 5 % Phenyl methyl siloxane | 1438. | Huang, Qin, et al., 2009 | 30. m/0.25 mm/0.25 μm, Helium; Program: 50 0C (2 min) 10 0C/min -> 150 0C 15 0C/min -> 300 0C (10 min) |
Capillary | BPX-5 | 1438. | Shellie, 2008 | 7.5 m/0.10 mm/10. μm, Helium; Program: not specified |
Capillary | HP-5MS | 1439. | Cole, Haber, et al., 2007 | 30. m/0.25 mm/0.25 μm, He; Program: 40C(10min) => 3C/min => 200C => 2C/min => 220C |
Capillary | CP Sil 8 CB | 1436. | Meekijjaroenroj, Bessière, et al., 2007 | 30. m/0.25 mm/0.25 μm, He; Program: 50C(3min) => 3C/min => 100C => 2.7C/min => 140C => 2.4C/min => 180C => 6C/min => 250C |
Capillary | HP-5 MS | 1439. | Moriarity, Bansal, et al., 2007 | 30. m/0.25 mm/0.25 μm, Helium; Program: 40 0C (10 min) 3 0C/min -> 200 0C 2 0C/min -> 220 0C |
Capillary | HP-5 MS | 1442. | Moriarity, Bansal, et al., 2007 | 30. m/0.25 mm/0.25 μm, Helium; Program: 40 0C (10 min) 3 0C/min -> 200 0C 2 0C/min -> 220 0C |
Capillary | HP-5 MS | 1439. | Setzer, Stokes, et al., 2007 | Helium; Column length: 30. m; Column diameter: 0.25 mm; Program: 40 0C (10 min) 3 oC/min -> 200 0C 2 0C/min -> 220 0C |
Capillary | HP-5MS | 1439. | Takaku, Haber, et al., 2007 | He; Column length: 30. m; Column diameter: 0.25 mm; Program: 40C(10min) => 3C/min => 200C => 2C/min => 220C |
Capillary | HP-5MS | 1448. | Deng, Xu, et al., 2006 | 30. m/0.25 mm/0.25 μm, He; Program: 50C(2min) => 6C/min => 200C => 10C/min => 270C(10min) |
Capillary | HP-5MS | 1420. | Li, Deng, et al., 2006 | 30. m/0.25 mm/0.25 μm, He; Program: 40C(1min) => 8C/min => 160C => 12C/min => 300C(5min) |
Capillary | DB-1 | 1440. | de Lima, Maia, et al., 2006 | He; Column length: 30. m; Column diameter: 0.25 mm; Program: 35C => 4C/min => 180C => 10C/min => 250C |
Capillary | DB-5 | 1441. | Hamm, Bleton, et al., 2005 | 30. m/0.25 mm/0.25 μm, He; Program: 40C(1min) => 9C/min => 130C => 2C/min => 230C |
Capillary | HP-5MS | 1439. | Deng, Li, et al., 2004 | 30. m/0.25 mm/0.25 μm, He; Program: 60C => 10C/min => 160C => 12C/min => 300C (5min) |
Capillary | HP-5MS | 1440. | Singh, Marimuthu, et al., 2004 | 30. m/0.25 mm/0.25 μm; Program: 60C(1min) => 1.5C/min => 185C(1min) => 9C/min => 275C(2min) |
Capillary | HP-5 | 1440. | Tepe, Donmez, et al., 2004 | 30. m/0.25 mm/0.25 μm, He; Program: 50C (3min) => 3C/min => 150C (10min) => 10C/min => 250C |
Capillary | SE-30 | 1446. | Vinogradov, 2004 | Program: not specified |
Capillary | SE-30 | 1446. | Vinogradov, 2004 | Program: not specified |
Capillary | DB-5 | 1441. | Hamm, Lesellier, et al., 2003 | 30. m/0.25 mm/0.25 μm, He; Program: 40C (1min) => 9C/min => 130C => 2C/min => 230C |
Capillary | CP Sil 8 CB | 1438. | Mockute, Nivinskiene, et al., 2003 | 50. m/0.32 mm/0.25 μm, He; Program: 60C(1min) => 5C/min => 160C => 10C/min => 250C(5min) |
Capillary | DB-5 | 1438. | Andrade, Maia, et al., 2000 | 30. m/0.25 mm/0.25 μm, He; Program: 40C => 2C/min => 60C => 4C/min => 260C |
Capillary | 5 % Phenyl methyl siloxane | 1453. | Sagrero-Nieves and Bartley, 1995 | Program: not specified |
Capillary | DB-1 | 1441. | Ishihara, Tsuneya, et al., 1993 | Program: not specified |

Normal alkane RI, polar column, temperature ramp

Column type | Active phase | I | Reference | Comment |
---|---|---|---|---|
Capillary | HP-Innowax | 1583. | Hachicha, Skanji, et al., 2007 | 30. m/0.25 mm/0.25 μm, He, 2. K/min, 240. C @ 20. min; Tstart: 60. C |
Capillary | CP-Wax 52CB | 1596. | Hymete, Rohloff, et al., 2007 | 30. m/0.32 mm/0.25 μm, He, 40. C @ 1. min, 3. K/min, 220. C @ 2. min |
Capillary | Innowax | 1611. | Joichi, Yomogida, et al., 2005 | 60. m/0.25 mm/0.25 μm, He, 5. K/min, 240. C @ 30. min; Tstart: 60. C |
Capillary | Innowax FSC | 1596. | Lourens, Reddy, et al., 2004 | Helium, 60. C @ 10. min, 4. K/min; Column length: 60. m; Column diameter: 0.25 mm; Tend: 220. C |
Capillary | DB-Wax | 1603. | Tamura, Boonbumrung, et al., 2000 | Nitrogen, 40. C @ 10. min, 2. K/min; Column length: 60. m; Column diameter: 0.25 mm; Tend: 200. C |
Capillary | Carbowax 20M | 1578. | Kollmannsberger, Nitz, et al., 1992 | 45. m/0.32 mm/1.0 μm, Hydrogen, 60. C @ 5. min, 2. K/min; Tend: 200. C |
Capillary | Carbowax 20M | 1600. | Gaydou, Faure, et al., 1989 | 50. m/0.32 mm/0.15 μm, H2, 2. K/min; Tstart: 70. C; Tend: 210. C |
Capillary | Supelcowax-10 | 1651. | Ramaswami, Briscese, et al., 1988 | 50. C @ 2. min, 4. K/min, 240. C @ 10. min; Column length: 30. m |
Capillary | Supelcowax-10 | 1651. | Ramaswami, Briscese, et al., 1986 | He, 50. C @ 2. min, 4. K/min, 240. C @ 10. min; Column length: 30. m |

Normal alkane RI, polar column, custom temperature program

Column type | Active phase | I | Reference | Comment |
---|---|---|---|---|
Capillary | Innowax FSC | 1596. | Bardakci, Demirci, et al., 2012 | 60. m/0.25 mm/0.25 μm, Helium; Program: 60 0C (10 min) 4 0C/min -> 220 0C 1 0C/min -> 240 0C |
Capillary | HP-Innowax FSC | 1596. | Erdurak, Coskun, et al., 2006 | 60. m/0.25 mm/0.25 μm, He; Program: 60C(10min) => 4C/min => 220C (10min) => 1C/min => 240C |
Capillary | Carbowax 20M | 1596. | Vinogradov, 2004 | Program: not specified |
Capillary | Carbowax 20M | 1652. | Vinogradov, 2004 | Program: not specified |
Capillary | Innowax FSC | 1596. | Baser, Demirei, et al., 2002 | 60. m/0.25 mm/0.25 μm, He; Program: 60C(10min) => 4C/min => 220C(10min) => 1C/min => 240C |

References

Sylvestre, Pichette, et al., 2006
Sylvestre, M.; Pichette, A.; Longtin, A.; Nagau, F.; Legault, J.,
Essential oil analysis and anticancer activity of leaf essential oil of Croton flavens L. from Guadeloupe,
J. Ethnopharmacol., 2006, 103, 1, 99-102, https://doi.org/10.1016/j.jep.2005.07.011
. [all data]
Medina, Lucero, et al., 2005
Medina, A.L.; Lucero, M.E.; Holguin, F.O.; Estell, R.E.; Posakony, J.J.; Simon, J.; O'Connell, M.A.,
Composition and antimicrobial activity of Anemopsis californica leaf oil,
J. Agric. Food Chem., 2005, 53, 22, 8694-8698, https://doi.org/10.1021/jf0511244
. [all data]
Shatar S., 2005
Shatar S.,
Essential oil of Ferula ferulaoides from Western Mongolia,
Chem. Nat. Compd. (Engl. Transl.), 2005, 41, 5, 607-608, https://doi.org/10.1007/s10600-005-0222-8
. [all data]
Ogunwande, Olawore, et al., 2004
Ogunwande, I.A.; Olawore, N.O.; Adeleke, K.A.; Ekundayo, O.; König, W.A.,
Rare terpenoid esters from Hyparrhenia rufa (Nees) Stapf. growing wild in Nigeria,
Flavour Fragr. J., 2004, 19, 3, 239-243, https://doi.org/10.1002/ffj.1295
. [all data]
Bouzouita, Kachouri, et al., 2003
Bouzouita, N.; Kachouri, F.; Hamdi, M.; Chaabouni, M.M.,
Antimicrobial activity of essential oils from Tunisian aromatic plants,
Flavour Fragr. J., 2003, 18, 5, 380-383, https://doi.org/10.1002/ffj.1200
. [all data]
Viña and Murillo, 2003
Viña, A.; Murillo, E.,
Essential oil composition from twelve varieties of basil (Ocimum spp) grown in Columbia,
J. Braz. Chem. Soc., 2003, 14, 5, 744-749, https://doi.org/10.1590/S0103-50532003000500008
. [all data]
Buchin, Salmon, et al., 2002
Buchin, S.; Salmon, J.-C.; Carnat, A.-P.; Berger, T.; Bugaud, C.; Bosset, J.O.,
Identification de composés monoterpéniques, sesquiterpéniques et benzéniques dans un lait d'alpage très riche en ces substances,
Mitt. Lebensmittelunters. Hyg., 2002, 93, 199-216. [all data]
Juliani and Simon, 2002
Juliani, H.R.; Simon, J.E.,
Antioxidant acitivity of basil
in Trends in new crops and new uses, Janick,J.; Whipkey,A., ed(s)., ASHA Press, Alexandria, Va, 2002, 575-579. [all data]
Raina, Srivastava, et al., 2002
Raina, V.K.; Srivastava, S.K.; Jain, N.; Ahmad, A.; Syamasundar, K.V.; Aggarwal, K.K.,
Essential oil composition of Curcuma longa L. cv. Roma from the plains of northern India,
Flavour Fragr. J., 2002, 17, 2, 99-102, https://doi.org/10.1002/ffj.1053
. [all data]
John, Rao, et al., 1999
John, K.S.; Rao, L.J.M.; Bhat, S.G.; Rao, U.J.S.P.,
Characterization of aroma components of sap from different Indian mango varieties,
Phytochemistry, 1999, 52, 5, 891-894, https://doi.org/10.1016/S0031-9422(99)00296-4
. [all data]
Siani, Ramos, et al., 1999
Siani, A.C.; Ramos, M.F.S.; Menezes-de-Lima, O., Jr.; Ribeiro-dos-Santos, R.; Fernadez-Ferreira, E.; Soares, R.O.A.; Rosas, E.C.; Susunaga, G.S.; Guimarães, A.C.; Zoghbi, M.G.B.; Henriques, M.G.M.O.,
Evaluation of anti-inflammatory-related activity of essential oils from the leaves and resin of species of Protium,
J. Ethnopharmacol., 1999, 66, 1, 57-69, https://doi.org/10.1016/S0378-8741(98)00148-2
. [all data]
da Silva, Andrade, et al., 1999
da Silva, M.H.L.; Andrade, E.H.A.; Zoghbi, M.G.B.; Luz, A.I.R.; da Silva, J.D.; Maia, J.G.S.,
The essential oils of Lantana camara L. occurring in North Brazil,
Flavour Fragr. J., 1999, 14, 4, 208-210, https://doi.org/10.1002/(SICI)1099-1026(199907/08)14:4<208::AID-FFJ811>3.0.CO;2-F
. [all data]
Senatore, Urrunaga Soria, et al., 1998
Senatore, F.; Urrunaga Soria, E.; Urrunaga Soria, R.; Porta, G.D.; de Feo, V.,
Essential oil from two peruvian Satureja species,
Flavour Fragr. J., 1998, 13, 1, 1-4, https://doi.org/10.1002/(SICI)1099-1026(199801/02)13:1<1::AID-FFJ672>3.0.CO;2-4
. [all data]
Jantan, Ahmad, et al., 1996
Jantan, I.; Ahmad, A.S.; Ahmad, A.R.; Ali, N.A.M.; Ayop, N.,
Chemical composition of some citrus oils from Malaysia,
J. Essent. Oil Res., 1996, 8, 6, 627-632, https://doi.org/10.1080/10412905.1996.9701030
. [all data]
Jantan, Ali, et al., 1995
Jantan, I.; Ali, N.A.M.; Ahmad, A.S.; Ahmad, A.R.,
Constituents of the essential oil of Leptospermum javanicum blume from peninsular Malaysia,
Flavour Fragr. J., 1995, 10, 4, 255-258, https://doi.org/10.1002/ffj.2730100406
. [all data]
Shellie and Marriott, 2003
Shellie, R.A.; Marriott, P.J.,
Comprehensive two-dimensional gas chromatography-mass spectrometry analysis of Pelargonium graveolens essential oil using rapid scanning quadrupole mass spectrometry,
Analyst, 2003, 128, 7, 879-883, https://doi.org/10.1039/b304371a
. [all data]
Silva, Barbosa, et al., 2007
Silva, C.J.; Barbosa, L.C.A.; Maltha, C.R.A.; Pinheiro, A.L.; Ismail, F.M.D.,
Comparative study of the essential oils of seven Melaleuca (Myrtaceae) species grown in Brazil,
Flavour Fragr. J., 2007, 22, 6, 474-478, https://doi.org/10.1002/ffj.1823
. [all data]
Basta, Tzakou, et al., 2006
Basta, A.; Tzakou, O.; Couladis, M.,
The essential oil composition of Phlomis cretica C. Presl,
Flavour Fragr. J., 2006, 21, 5, 795-797, https://doi.org/10.1002/ffj.1717
. [all data]
Cavalli, Tomi, et al., 2006
Cavalli, J.-F.; Tomi, F.; Bernardini, A.-F.; Casanova, J.,
Chemical variability of the essential oil of Helichrysum faradifani Sc. Ell. from Madagascar,
Flavour Fragr. J., 2006, 21, 1, 111-114, https://doi.org/10.1002/ffj.1531
. [all data]
Pavlovic, Kovacevic, et al., 2006
Pavlovic, M.; Kovacevic, N.; Tzakou, O.; Couladis, M.,
Essential oil composition of Anthemis triumfetti (L.) DC.,
Flavour Fragr. J., 2006, 21, 2, 297-299, https://doi.org/10.1002/ffj.1592
. [all data]
Silva-Brandão, Solferini, et al., 2006
Silva-Brandão, K.L.; Solferini, V.N.; Trigo, J.R.,
Chemical and phylogenetic relationships among Aristolochia L. (Aristolochiaceae) from southeastern Brazil,
Biochem. Syst. Ecol., 2006, 34, 4, 291-302, https://doi.org/10.1016/j.bse.2005.10.011
. [all data]
Ziegenbein, Hanssen, et al., 2006
Ziegenbein, F.C.; Hanssen, H.-P.; König, W.A.,
Chemical constituents of the essential oils of three wood-rotting fungi,
Flavour Fragr. J., 2006, 21, 5, 813-816, https://doi.org/10.1002/ffj.1732
. [all data]
Celik, Gokturk, et al., 2005
Celik, S.; Gokturk, R.S.; Flamini, G.; Cioni, P.L.; Morelli, I.,
Essential oils of Phlomis leucophracta, Phlomis chimerae and Phlomis grandiflora var. grandiflora from Turkey,
Biochem. Syst. Ecol., 2005, 33, 6, 617-623, https://doi.org/10.1016/j.bse.2004.11.010
. [all data]
Dob, Berramdane, et al., 2005
Dob, T.; Berramdane, T.; Chelgoum, C.,
Chemical composition of essential oil of Pinus halepensis Miller growing in Algeria,
C.R. Chim., 2005, 8, 11-12, 1939-1945, https://doi.org/10.1016/j.crci.2005.05.007
. [all data]
Flamini, Luigi Cioni, et al., 2005
Flamini, G.; Luigi Cioni, P.; Morelli, I.; Celik, S.; Gokturk, R.S.; Unal, O.,
Essential oil of Stachys aleurites from Turkey,
Biochem. Syst. Ecol., 2005, 33, 1, 61-66, https://doi.org/10.1016/j.bse.2004.05.013
. [all data]
Pino, Mesa, et al., 2005
Pino, J.A.; Mesa, J.; Muñoz, Y.; Martí, M.P.; Marbot, R.,
Volatile components from mango (Mangifera indica L.) cultivars,
J. Agric. Food Chem., 2005, 53, 6, 2213-2223, https://doi.org/10.1021/jf0402633
. [all data]
Tchoumbougnang, Zollo, et al., 2005
Tchoumbougnang, F.; Zollo, P.H.A.; Boyom, F.F.; Nyegue, M.A.; Bessière, J.M.; Menut, C.,
Aromatic plants of tropical Central Africa. XLVIII. Comparative study of the essential oils of four Hyptis species from Cameroon: H. lanceolata Poit., H. pectinata (L.) Poit., H. spicigera Lam. and H. suaveolens Poit.,
Flavour Fragr. J., 2005, 20, 3, 340-343, https://doi.org/10.1002/ffj.1441
. [all data]
Antunes, Sevinate-Pinto, et al., 2004
Antunes, T.; Sevinate-Pinto, I.; Barroso, J.G.; Cavaleiro, C.; Salgueiro, L.R.,
Micromorphology of trichomes and composition of essential oil of Teucrium capitatum,
Flavour Fragr. J., 2004, 19, 4, 336-340, https://doi.org/10.1002/ffj.1310
. [all data]
Fernández-Ocaña, Gómez-Rodríguez, et al., 2004
Fernández-Ocaña, A.M.; Gómez-Rodríguez, M.V.; Velasco-Negueruela, A.; Camacho-Simarro, A.M.; Fernández-López, C.; Altarejos, J.,
In vivo antifungal activity of the essential oil of Bupleurum gibraltarium against plasmopara halstedii in sunflower,
J. Agric. Food Chem., 2004, 52, 21, 6414-6417, https://doi.org/10.1021/jf040219n
. [all data]
Flamini, Cioni, et al., 2004
Flamini, G.; Cioni, P.L.; Morelli, I.; Maccioni, S.; Baldini, R.,
Phytochemical typologies in some populations of Myrtus communis L. on Caprione Promontory (East Liguria, Italy),
Food Chem., 2004, 85, 4, 599-604, https://doi.org/10.1016/j.foodchem.2003.08.005
. [all data]
Flach A., Dondon R.C., et al., 2004
Flach A.; Dondon R.C.; Singer R.B.; Koehler S.; Amaral M.D.E.; Marsaioli A.J.,
The chemistry of pollination in selected Brazilian maxillariinae orchids: Floral rewards and fragrance,
J. Chem. Ecol., 2004, 30, 5, 1045-1056, https://doi.org/10.1023/B:JOEC.0000028466.50392.ed
. [all data]
Karioti, Hadjipavlou-Litina, et al., 2004
Karioti, A.; Hadjipavlou-Litina, D.; Mensah, M.L.K.; Fleischer, T.C.; Skaltsa, H.,
Composition and antioxidant activity of the essential oils of Xylopia aethiopica (Dun) A. Rich. (Annonaceae) leaves, stem bark, root bark, and fresh and dried fruits, growing in Ghana,
J. Agric. Food Chem., 2004, 52, 26, 8094-8098, https://doi.org/10.1021/jf040150j
. [all data]
Sartoratto, Machado, et al., 2004
Sartoratto, A.; Machado, A.L.M.; Delarmelina, C.; Figueira, G.M.; Duarte, M.C.T.; Rehder, V.L.G.,
Composition and antimicrobial activity of essential oils from aromatic plants used in Brazil,
Braz. J. Microbiol., 2004, 35, 4, 275-280, https://doi.org/10.1590/S1517-83822004000300001
. [all data]
Flamini, Luigi Cioni, et al., 2003
Flamini, G.; Luigi Cioni, P.; Morelli, I.,
Short communication. Use of solid-phase micro-extraction as a sampling technique in the determination of volatiles emitted by flowers, isolated flower parts and pollen,
J. Chromatogr. A, 2003, 998, 1-2, 229-233, https://doi.org/10.1016/S0021-9673(03)00641-1
. [all data]
Högnadóttir and Rouseff, 2003
Högnadóttir, Á.; Rouseff, R.L.,
Identification of aroma active compounds in organce essence oil using gas chromatography-olfactometry and gas chromatography-mass spectrometry,
J. Chromatogr. A, 2003, 998, 1-2, 201-211, https://doi.org/10.1016/S0021-9673(03)00524-7
. [all data]
Karioti, Skaltsa, et al., 2003
Karioti, A.; Skaltsa, H.; Demetzos, C.; Perdetzoglou, D.; Economakis, C.D.; Salem, A.B.,
Effect of nitrogen concentration of the nutrient solution on the volatile constituents of leaves of Salvia fruticosa Mill. in solution culture,
J. Agric. Food Chem., 2003, 51, 22, 6505-6508, https://doi.org/10.1021/jf030308k
. [all data]
Macchioni, Cioni, et al., 2003
Macchioni, F.; Cioni, P.L.; Flamini, G.; Morelli, I.; Maccioni, S.; Ansaldi, M.,
Chemical composition of essential oils from needles, branches and cones of Pinus pinea, P. halepensis, P. pinaster and P. nigra from central Italy,
Flavour Fragr. J., 2003, 18, 2, 139-143, https://doi.org/10.1002/ffj.1178
. [all data]
Salido, Altarejos, et al., 2003
Salido, S.; Altarejos, J.; Nogueras, M.; Sánchez, A.; Luque, P.,
Chemical composition and seasonal variations of rosemary oil from Southern Spain,
J. Essent. Oil Res., 2003, 15, 1, 10-14, https://doi.org/10.1080/10412905.2003.9712248
. [all data]
Demetzos, Angelopoulou, et al., 2002
Demetzos, C.; Angelopoulou, D.; Perdetzoglou, D.,
A comparative study of the essential oils of Cistus salviifolius in several populations of Crete (Greece),
Biochem. Syst. Ecol., 2002, 30, 7, 651-665, https://doi.org/10.1016/S0305-1978(01)00145-4
. [all data]
Flamini, Cioni, et al., 2002
Flamini, G.; Cioni, P.L.; Morelli, I.,
Differences in the fragrances of pollen and different floral parts of male and female flowers of Laurus nobilis,
J. Agric. Food Chem., 2002, 50, 16, 4647-4652, https://doi.org/10.1021/jf020269x
. [all data]
Fokialakis, Magiatis, et al., 2002
Fokialakis, N.; Magiatis, P.; Mitaku, S.,
Essential oil constituents of Valeriana italica and Valeriana tuberosa. Stereochemical and conformational study of 15-acetoxyvaleranone,
Z. Naturforsch., 2002, 57c, 791-796. [all data]
bin Jantan and bin Ahmad, 2002
bin Jantan, I.; bin Ahmad, F.,
Chemical constituents of the essential oils of Goniothalamus malayanus Hook. f. and Thoms.,
Flavour Fragr. J., 2002, 17, 5, 372-374, https://doi.org/10.1002/ffj.1107
. [all data]
Javidnia, Miri, et al., 2002
Javidnia, K.; Miri, R.; Kamalinejad, M.; Nasiri, A.,
Composition of the essential oil of Salvia mirzayanii Rech. f. Esfand from Iran,
Flavour Fragr. J., 2002, 17, 6, 465-467, https://doi.org/10.1002/ffj.1128
. [all data]
Kovacevic, Pavlovic, et al., 2002
Kovacevic, N.; Pavlovic, M.; Menkovic, N.; Tzakou, O.; Couladis, M.,
Composition of the essential oil from roots and rhizomes of Valeriana pancicii Halácsy Bald,
Flavour Fragr. J., 2002, 17, 5, 355-357, https://doi.org/10.1002/ffj.1100
. [all data]
Mondello, Zappia, et al., 2002
Mondello, L.; Zappia, G.; Cotroneo, A.; Bonaccorsi, I.; Chowdhury, J.U.; Yusuf, M.; Dugo, G.,
Studies on the essential oil-bearing plants of Bangladesh. Part VIII. Composition of some Ocimum oils O. basilicum L. var. purpurascens; O. sanctum L. green; O. sanctum L. purple; O. americanum L., citral type; O. americanum L., camphor type,
Flavour Fragr. J., 2002, 17, 5, 335-340, https://doi.org/10.1002/ffj.1108
. [all data]
Couladis, Tsortanidou, et al., 2001
Couladis, M.; Tsortanidou, V.; Francisco-Ortega, J.; Santos-Guerra, A.; Harvala, C.,
Composition of the essential oils of Argyranthemum species growing in the Canary Islands,
Flavour Fragr. J., 2001, 16, 2, 103-106, https://doi.org/10.1002/ffj.954
. [all data]
Hudaib, Grazia Bellardi, et al., 2001
Hudaib, M.; Grazia Bellardi, M.; Rubies-Autonell, C.; Fiori, J.; Cavrini, V.,
Chromatographic (GC-MS, HPLC) and virological evaluations of Salvia sclarea infected by BBWV-I,
Farmaco, 2001, 56, 3, 219-227, https://doi.org/10.1016/S0014-827X(01)01038-2
. [all data]
Skaltsa, Mavrommati, et al., 2001
Skaltsa, H.D.; Mavrommati, A.; Constantinidis, T.,
A chemotaxonomic investigation of volatile constituents in Stachys subsect. Swainsonianeae (Labiatae),
Phytochemistry, 2001, 57, 2, 235-244, https://doi.org/10.1016/S0031-9422(01)00003-6
. [all data]
Bartley and Jacobs, 2000
Bartley, J.P.; Jacobs, A.L.,
Effects of drying on flavour compounds in Australian-grown ginger (Zingiber officinale),
J. Sci. Food Agric., 2000, 80, 2, 209-215, https://doi.org/10.1002/(SICI)1097-0010(20000115)80:2<209::AID-JSFA516>3.0.CO;2-8
. [all data]
Maia, de Paula, et al., 2000
Maia, B.H.L.N.S.; de Paula, J.R.; Sant'Ana, J.; da Silva, M.F.G.F.; Fernandes, J.B.; Vieira, P.C.; Costa, M.S.S.; Ohashi, O.S.; Silva, J.N.M.,
Essential oils of Toona and Cedrela species (Meliaceae): Taxonomic and ecological implications,
J. Braz. Chem. Soc., 2000, 11, 6, 629-639, https://doi.org/10.1590/S0103-50532000000600012
. [all data]
Verzera, Trozzi, et al., 2000
Verzera, A.; Trozzi, A.; Cotroneo, A.; Lorenzo, D.; Dellacassa, E.,
Uruguayan essential oil. 12. Composition of Nova and Satsuma mandarin oils,
J. Agric. Food Chem., 2000, 48, 7, 2903-2909, https://doi.org/10.1021/jf990734z
. [all data]
Sagrero-Nieves, Bartley, et al., 1997
Sagrero-Nieves, L.; Bartley, J.P.; Griselda Espinosa, B.; Dominguez, X.A.; Julia Verde S.,
Essential oil composition of Aristolochia brevipes Benth.,
Flavour Fragr. J., 1997, 12, 6, 401-403, https://doi.org/10.1002/(SICI)1099-1026(199711/12)12:6<401::AID-FFJ673>3.0.CO;2-D
. [all data]
Stashenko, Wiame, et al., 1995
Stashenko, E.; Wiame, H.; Dassy, S.; Martinez, J.R.; Shibamoto, T.,
Catalytic transformation of copaiba (Copaifera officinalis) oil over zeolite ZSM-5,
J. Hi. Res. Chromatogr., 1995, 18, 1, 54-58, https://doi.org/10.1002/jhrc.1240180112
. [all data]
Andrade, Sampaio, et al., 2007
Andrade, M.S.; Sampaio, T.S.; Nogueira, P.C.L.; Ribeiro, A.S.; Bittrich, V.; Amaral, M.C.E.,
Volatile compounds of the leaves, flowers and fruits of Kielmeyera rugosa Choisy (Clusiaceae),
Flavour Fragr. J., 2007, 22, 1, 49-52, https://doi.org/10.1002/ffj.1751
. [all data]
Silva, Oliveira, et al., 2007
Silva, F.G.; Oliveira, C.B.A.; Pinto, J.E.B.P.; Nascimento, V.E.; Santos, S.C.; Seraphin, J.C.; Ferri, P.H.,
Seasonal Variability in the Essential Oils of Wild and Cultivated Baccharis trimera,
J. Braz. Chem. Soc., 2007, 18, 5, 990-997, https://doi.org/10.1590/S0103-50532007000500017
. [all data]
Cardeal, da Silva, et al., 2006
Cardeal, Z.L.; da Silva, M.D.R.G.; Marriott, P.J.,
Comprehensive two-dimensional gas chromatography/mass spectrometric analysis of pepper volatiles,
Rapid Commun. Mass Spectrom., 2006, 20, 19, 2823-2836, https://doi.org/10.1002/rcm.2665
. [all data]
Özel, Gögüs, et al., 2006
Özel, M.Z.; Gögüs, F.; Lewis, A.C.,
Determination of Teucrium chamaedrys volatiles by using direct thermal desorption-comprehensive two-dimensional gas chromatography-time-of-flight mass spectrometry,
J. Chromatogr. A, 2006, 1114, 1, 164-169, https://doi.org/10.1016/j.chroma.2006.02.036
. [all data]
Lorenzo, Paz, et al., 2005
Lorenzo, D.; Paz, D.; Davies, P.; Villamil, J.; Vila, R.; Canigueral, S.; Dellacassa, E.,
Application of Multidimensional Gas Chromatography to the Enantioselective Characterisation of the Essential Oil of Eupatorium buniifolium Hooker et Arnott,
Phytochem. Anal., 2005, 16, 1, 39-44, https://doi.org/10.1002/pca.808
. [all data]
Díaz-Maroto, Sánchez Palomo, et al., 2004
Díaz-Maroto, M.C.; Sánchez Palomo, E.; Castro, L.; González Viñas, M.A.; Pérez-Coello, M.S.,
Changes produced in the aroma compounds and structural integrity of basil (Ocimum basilicum L) during drying,
J. Sci. Food Agric., 2004, 84, 15, 2070-2076, https://doi.org/10.1002/jsfa.1921
. [all data]
Isidorov, Krajewska, et al., 2000
Isidorov, V.; Krajewska, U.; Bal, K.; Jaroszynska, J.; Niesluchowska, A.; Fuksman, I.,
GC-MS identification of multicomponent organic compounds mixtures using extra column phase equilibrium,
Chem. Anal. (Warsaw), 2000, 45, 513-520. [all data]
Hemmateenejad, Jawadnia, et al., 2007
Hemmateenejad, B.; Jawadnia, K.; Elyasi, M.,
Quantitative structure - retention relationship for the Kovats retention indices of a large set of terpenes: a comdined data splitting-feature selection strategy,
Anal. Chim. Acta, 2007, 592, 1, 72-81, https://doi.org/10.1016/j.aca.2007.04.009
. [all data]
Vijayakumar, Duraipandiyan, et al., 2012
Vijayakumar, A.; Duraipandiyan, V.; Jeyarai, B.; Agastian, P.; Raj, M.K.; Ignacimunthu, S.,
Phytochemical analysis and in vitro antimicrobial activity of Illicium griffithii Hook f. Thoms extracts,
Asian Pacific J. Tropical Diseases, 2012, 2, 3, 190-199, https://doi.org/10.1016/S2222-1808(12)60045-0
. [all data]
Hammami, Kamoun, et al., 2011
Hammami, I.; Kamoun, N.; Rebai, A.,
Biocontrol of Botrytis cinerea with essential oil and methanol extract of Viola odorata flowers,
Archives of Appl. Sci. Res., 2011, 3, 5, 44-51. [all data]
Kahriman, Tosun, et al., 2011
Kahriman, N.; Tosun, G.; Terzioglu, S.; Karaoglu, S.A.; Yayh, N.,
Chemical composition and antimicrobial activity of the essential oils from the flower, leaf, and stem of Senecio pandurifolis,
Rec. Nat. Prod., 2011, 5, 2, 82-91. [all data]
Prasad, Moulekhi, et al., 2011
Prasad, K.; Moulekhi, K.; Bisht, G.,
Chemical composition of the essential oil of Pavetta indica L. leaves,
Res. J. Phytochem., 2011, 5, 1, 66-69, https://doi.org/10.3923/rjphyto.2011.66.69
. [all data]
Hu, Liang, et al., 2010
Hu, C.-D.; Liang, Y.-Z.; Guo, F.-Q.; Li, X.-R.; Wang, W.-P.,
Determination of essential oil composition from Osmanthus fragrans tea by GC-MS combined with a chemometric resolution method,
Molecules, 2010, 15, 5, 3683-3693, https://doi.org/10.3390/molecules15053683
. [all data]
Kahriman, Tosun, et al., 2010
Kahriman, N.; Tosun, G.; Genc, H.; Yayli, N.,
Comparative essential oil analysis of Geranium sylvaticum estracted by hydrodistillation and microwave distillation,
Turk. J. Chem., 2010, 34, 969-976. [all data]
Mesa-Arango, Betancur-Galvis, et al., 2010
Mesa-Arango, A.C.; Betancur-Galvis, L.; Montiel, J.; Bueno, J.G.; Baena, A.; Duran, D.C.; Martinez, J.R.; Stashenko, E.E.,
Antifungal activity and chemical composition of the essential oils of Lippia alba (Miller) N.E. Brown grown in different regions of Colombia,
J. Essential Oil Res., 2010, 22, 6, 568-574, https://doi.org/10.1080/10412905.2010.9700402
. [all data]
Silva, Pott, et al., 2010
Silva, D.B.; Pott, A.; Oliveira, D.C.R.,
Analyses of the headspace volatile constituents of aerial parts (leaves and stems), flowers and fruits of Bidens gardneri Bak. and Bidens sulphurea (Cav.) Sch. Bip. using solid-phase microextraction,
J. Essen. Oil Res., 2010, 22, 6, 560-563, https://doi.org/10.1080/10412905.2010.9700400
. [all data]
Xu, Tang, et al., 2010
Xu, X.; Tang, Z.; Liang, Y.,
Comparative analysis of plant essential oils by GC-MS coupled with integrated chemometric resolution methods,
Anal. Methods, 2010, 2, 4, 359-367, https://doi.org/10.1039/b9ay00213h
. [all data]
Hnawia, Menut, et al., 2009
Hnawia, E.; Menut, C.; Agrebi, A.; Cabalion, P.,
Wood essential oil of two endemic trees from New Caledonia: Callitris sulcata (Parl.) Schltr. and Callitris neocaledonica Dummer,
Biochem. Systematics Ecol., 2009, 36, 11, 859-866, https://doi.org/10.1016/j.bse.2008.08.007
. [all data]
Ho, Wang, et al., 2009
Ho, C.-L.; Wang, E.I.-C.; Su, Y.-C.,
Essential oil compositions and bioactivities of the various parts of Cinnamomum camphora Sieb. var. linallolifera Fujuta,
Journal title only in Chinese, 2009, 31, 2, 77-96. [all data]
Maridass, 2009
Maridass, M.,
Inter-generic relationships of Ocimum and Origanum based on GC-MS volatile oils data using software NTSPSpc version 2.0,
Ethnobotanical Leaflets, 2009, 13, 83-88. [all data]
Retta, Gattuso, et al., 2009
Retta, D.; Gattuso, M.; Gattuso, S.; Lira, P. Di Leo; van Baren, C.; Ferraro, G.; Bandoni A.,
Essential oil composition of Achyrocline flaccida (Weinm.) DC. (Asteraceae) from different locations of Argentina,
Biochem. Systematics Ecol., 2009, 36, 12, 877-881, https://doi.org/10.1016/j.bse.2008.11.001
. [all data]
Khokra, Prakash, et al., 2008
Khokra, S.L.; Prakash, O.; Jain, S.; Aneja, K.R.; Dhingra, Y.,
Essential oil composition and antibacterial studies of Vitex negundo Linn. extracts,
Indian J. Pharm. Sci., 2008, 70, 4, 522-526, https://doi.org/10.4103/0250-474X.44610
. [all data]
Kowalski, 2008
Kowalski, R.,
Antimicrobial activity of essential oils and extracts of rosinweed (Silphoum trifoliatum and Silphium integrifolium) plants used by the American Indians,
Flav. Fragr. J., 2008, 23, 6, 426-433, https://doi.org/10.1002/ffj.1901
. [all data]
Shellie, 2008
Shellie, R.A.,
Comprehensive 2D GC-QPMS with differential flow modulation,
LV-GC, 2008, 11, 7-18. [all data]
Andrade, Oliveira, et al., 2007
Andrade, E.H.A.; Oliveira, J.; Zoghbi, M.G.B.,
Volatiles of Anaxagorea dolichocarpa Spreng. Sandw. and Annona densicoma Mart. Growing Wild in the State of Pará, Brazil,
Flavour Fragr. J., 2007, 22, 2, 158-160, https://doi.org/10.1002/ffj.1776
. [all data]
Basta, Pavlovic, et al., 2007
Basta, A.; Pavlovic, M.; Couladis, M.; Tzakou, O.,
Essential oil composition of the flowerheads of Chrysanthemum coronarium L. from Greece,
Flavour Fragr. J., 2007, 22, 3, 197-200, https://doi.org/10.1002/ffj.1781
. [all data]
Farsam, Amanlou, et al., 2007
Farsam, H.; Amanlou, M.; Taghi-Cheetsaz, N.; Amin, G.R.; Saledi-Sormaghi, M.H.,
Essential Oil of Chimonanthus fragrans flowers Population of Tehran,
DARU, 2007, 15, 3, 129-131. [all data]
Hachicha, Skanji, et al., 2007
Hachicha, S.F.; Skanji, T.; Barrek, S.; Ghrabi, Z.G.; Zarrouk, H.,
Composition of the essential oil of Teucrium ramosissimum Desf. (Lamiaceae) from Tunisia,
Flavour Fragr. J., 2007, 22, 2, 101-104, https://doi.org/10.1002/ffj.1764
. [all data]
Raal, Orav, et al., 2007
Raal, A.; Orav, A.; Arak, E.; Kailas, T.; Müürisepp, M.,
Variation in the composition of the essential oil of Valeriana officinalis L. roots from Estonia,
Proc. Est. Acad. Sci. Chem., 2007, 56, 2, 67-74. [all data]
Bertrand, Comte, et al., 2006
Bertrand, C.; Comte, G.; Piola, F.,
Solid-phase microextraction of volatile compounds from flowers of two Brunfelsia species,
Biochem. Syst. Ecol., 2006, 34, 5, 371-375, https://doi.org/10.1016/j.bse.2005.12.005
. [all data]
Bozin, Mimicá-Dukic, et al., 2006
Bozin, B.; Mimicá-Dukic, N.; Simin, N.; Anackov, G.,
Characterization of the volatile composition of essential oils of some lamiaceae spices and the antimicrobial and antioxidant activities of the entire oils,
J. Agric. Food Chem., 2006, 54, 5, 1822-1828, https://doi.org/10.1021/jf051922u
. [all data]
Hymete, Rohloff, et al., 2006
Hymete, A.; Rohloff, J.; Iversen, T.-H.,
Essential oil from seeds and husks of Aframomum corrorima from Ethiopia,
Flavour Fragr. J., 2006, 21, 4, 642-644, https://doi.org/10.1002/ffj.1634
. [all data]
Mirza, Navaei, et al., 2006
Mirza, M.; Navaei, M.N.; Dini, M.,
Volatile constituents of essential oils isolated from flowers and leaves of Eupatorium cannabinum L. from Iran,
Iranian J. Pharmaceutical Res., 2006, 2, 149-152. [all data]
Nickavar B., Kamalinejad M., et al., 2006
Nickavar B.; Kamalinejad M.; Mohandesi S.,
Comparison of the components of the essential oils from leaves and fruits of Grammosciadium platycarpum,
Chem. Nat. Compd. (Engl. Transl.), 2006, 42, 6, 686-688, https://doi.org/10.1007/s10600-006-0252-x
. [all data]
Pala-Paul J., Perez-Alonso M.J., et al., 2006
Pala-Paul J.; Perez-Alonso M.J.; Velasco-Negueruela A.; Ballesteros M.T.; Sanz J.,
Essential oil composition of Sideritis hirsuta L. from Guadalajara Province, Spain,
Flavour Fragr. J., 2006, 21, 3, 410-415, https://doi.org/10.1002/ffj.1727
. [all data]
Pino, Marbot, et al., 2006
Pino, J.A.; Marbot, R.; Payo, A.; Chao, D.; Herrera, P.,
Aromatic Plants from Western Cuba VII. Composition of the Leaf Oil of Psidium wrightii KRug et Urb., Lantana involucrata L., Cinnamonum montanum (Sw.) Berchtold et J. Persl. and Caesalpinia violacea (Mill.) Standley,
J. Essent. Oil. Res., 2006, 18, 2, 170-174, https://doi.org/10.1080/10412905.2006.9699058
. [all data]
Chagonda and Chalchat, 2005
Chagonda, L.S.; Chalchat, J.-C.,
The essential oil of the fruit of Garcinia huillensis Welw. ex. Oliv. from Zimbabwe,
Flavour Fragr. J., 2005, 20, 3, 313-315, https://doi.org/10.1002/ffj.1420
. [all data]
Morteza-Semnani and Saeedi, 2005
Morteza-Semnani, K.; Saeedi, M.,
The essential oil composition of Hypericum androsaemum L. leaves and flowers from Iran,
Flavour Fragr. J., 2005, 20, 3, 332-334, https://doi.org/10.1002/ffj.1432
. [all data]
Pala-Paul, Perez-Alonso, et al., 2005
Pala-Paul, J.; Perez-Alonso, M.J.; Velasco-Negueruela, A.; Vadare, J.; Villa, A.M.; Sanz, J.; Brophy, J.J.,
Essential oil composition of the different parts of Eryngium bourgatii Gouan from Spain,
J. Chromatogr. A, 2005, 1074, 1-2, 235-239, https://doi.org/10.1016/j.chroma.2005.03.036
. [all data]
Pellati, Benvenuti, et al., 2005
Pellati, F.; Benvenuti, S.; Yoshizaki, F.; Bertelli, D.; Rossi, M.C.,
Headspace solid-phase microextraction-gas chromatography-mass spectrometry analysis of the volatile compounds of Evodia species fruits,
J. Chromatogr. A, 2005, 1087, 1-2, 265-273, https://doi.org/10.1016/j.chroma.2005.01.060
. [all data]
Slavkovska, Couladis, et al., 2005
Slavkovska, V.; Couladis, M.; Bojovic, S.; Tzakou, O.; Pavlovic, M.; Lakusic, B.; Jancic, R.,
Essential oil and its systematic significance in species of Micromeria Bentham from Serbia Montenegro,
Plant Systematics and Evolution, 2005, 255, 1-2, 1-15, https://doi.org/10.1007/s00606-005-0303-y
. [all data]
Velasco-Negueruela, Pérez-Alonso, et al., 2005
Velasco-Negueruela, A.; Pérez-Alonso, M.J.; Pérez de Paz, P.L.; Palá-Paúl, J.; Sanz, J.,
Analysis by gas chromatography-mass spectrometry of the essential oils from the aerial parts of Pimpinella anagodendron Bolle and Pimpinella rupicola Svent., two endemic species to the Canary Islands, Spain,
J. Chromatogr. A, 2005, 1095, 1-2, 180-184, https://doi.org/10.1016/j.chroma.2005.09.074
. [all data]
Kilic, Hafizoglu, et al., 2004
Kilic, A.; Hafizoglu, H.; Kollmannsberger, H.; Nitz, S.,
Volatile constituents and key odorants in leaves, buds, flowers, and fruits of Laurus nobilis L.,
J. Agric. Food Chem., 2004, 52, 6, 1601-1606, https://doi.org/10.1021/jf0306237
. [all data]
Orav, Stulova, et al., 2004
Orav, A.; Stulova, I.; Kailas, T.; Müürisepp, M.,
Effect of storage on the essential oil composition of piper nigrum L. fruits of different ripening states,
J. Agric. Food Chem., 2004, 52, 9, 2582-2586, https://doi.org/10.1021/jf030635s
. [all data]
Jirovetz, Buchbauer, et al., 2003
Jirovetz, L.; Buchbauer, G.; Shafi, M.P.; Kaniampady, M.M.,
Chemotaxonomical analysis of the essential oil aroma compounds of four different Ocimumspecies from southern India,
Eur. Food Res. Technol., 2003, 217, 2, 120-124, https://doi.org/10.1007/s00217-003-0708-1
. [all data]
Jirovetz, Buchbauer, et al., 2003, 2
Jirovetz, L.; Buchbauer, G.; Shafi, M.P.; Leela, N.K.,
Analysis of the essential oils of the leaves, stems, rhizomes and roots of the medicinal plant Alpinia galanga from southern India,
Acta Pharm. Hung., 2003, 53, 73-81. [all data]
Marongiu, Porcedda, et al., 2003
Marongiu, B.; Porcedda, S.; Caredda, A.; de Gioannis, B.; Vargiu, L.; la Colla, P.,
Extraction of Juniperus oxycedrus ssp. Oxycedrus essential oil by supercritical carbon dioxide: influence of some process parameters and biological activity,
Flavour Fragr. J., 2003, 18, 5, 390-397, https://doi.org/10.1002/ffj.1224
. [all data]
Oyedeji, Ekundayo, et al., 2003
Oyedeji, O.A.; Ekundayo, O.; König, W.A.,
Volatile leaf oil constituents of Lantana camara L. from Nigeria,
Flavour Fragr. J., 2003, 18, 5, 384-386, https://doi.org/10.1002/ffj.1206
. [all data]
Pitarokili, Tzakou, et al., 2003
Pitarokili, D.; Tzakou, O.; Loukis, A.; Harvala, C.,
Volatile metabolites from Salvia fruticosa as antifungal agents in soilborne pathogens,
J. Agric. Food Chem., 2003, 51, 11, 3294-3301, https://doi.org/10.1021/jf0211534
. [all data]
Caredda, Marongiu, et al., 2002
Caredda, A.; Marongiu, B.; Porcedda, S.; Soro, C.,
Supercritical carbon dioxide extraction and characterization of Laurus nobilis essential oil,
J. Agric. Food Chem., 2002, 50, 6, 1492-1496, https://doi.org/10.1021/jf0108563
. [all data]
Jirovetz, Buchbauer, et al., 2002
Jirovetz, L.; Buchbauer, G.; Ngassoum, M.B.; Geissler, M.,
Aroma compound analysis of Piper nigrum and Piper guineense essential oils from Cameroon using solid-phase microextraction-gas chromatography, solid-phase microextraction-gas chromatography-mass spectrometry and olfactometry,
J. Chromatogr. A, 2002, 976, 1-2, 265-275, https://doi.org/10.1016/S0021-9673(02)00376-X
. [all data]
Kobaisy, Tellez, et al., 2002
Kobaisy, M.; Tellez, M.R.; Dayan, F.E.; Duke, S.O.,
Phytotoxicity and volatile constituents from leaves of Callicarpa japonica Thunb.,
Phytochemistry, 2002, 61, 1, 37-40, https://doi.org/10.1016/S0031-9422(02)00207-8
. [all data]
Krauze-Baranowska, Mardarowicz, et al., 2002
Krauze-Baranowska, M.; Mardarowicz, M.; Wiwart, M.; Poblocka, L.; Dynowska, M.,
Antifungal activity of the essential oils from some species of the genus Pinus,
Z. Naturforsch., 2002, 57c, 478-482. [all data]
Mahmout, Bessière, et al., 2002
Mahmout, Y.; Bessière, J.-M.; Dolmazon, R.,
Constituents of the essential oil of Cyperus maculatus Boëck,
J. Essent. Oil Res., 2002, 14, 4, 263-265, https://doi.org/10.1080/10412905.2002.9699848
. [all data]
Maia, Zoghbi, et al., 2002
Maia, J.G.S.; Zoghbi, M.G.B.; Andrade, E.H.A.; da Silva, M.H.L.; Luz, A.I.R.; da Silva, J.D.,
Essential oils composition of Eupatorium species growing wild in the Amazon,
Biochem. Syst. Ecol., 2002, 30, 11, 1071-1077, https://doi.org/10.1016/S0305-1978(02)00059-5
. [all data]
Zoghbi, Andrade, et al., 2002
Zoghbi, M.G.B.; Andrade, E.H.A.; da Silva, M.H.L.; Maia, J.G.S.,
Volatile constituents of Lippia lupulina Cham.,
Flavour Fragr. J., 2002, 17, 1, 29-31, https://doi.org/10.1002/ffj.1032
. [all data]
Santos-Gomes and Fernandes-Ferreira, 2001
Santos-Gomes, P.C.; Fernandes-Ferreira, M.,
Organ- and season-dependent variation in the essential oil composition of Salvia officinalis L. cultivated at two different sites,
J. Agric. Food Chem., 2001, 49, 6, 2908-2916, https://doi.org/10.1021/jf001102b
. [all data]
Santos, Moreira, et al., 2001
Santos, P.R.; Moreira, D.L.; Guimaraes, E.F.; Kaplan, M.A.C.,
Essential oil analysis of 10 piperaceae species from the Brazilian Atlantic forest,
Phytochemistry, 2001, 58, 4, 547-551, https://doi.org/10.1016/S0031-9422(01)00290-4
. [all data]
Tellez M., Estell R., et al., 2001
Tellez M.; Estell R.; Fredrickson E.; Powell J.; Wedge D.; Schrader K.; Kobaisy M.,
Extracts of Flourensia cernua (L): Volatile constituents and antifungal, antialgal, and antitermite bioactivities,
J. Chem. Ecol., 2001, 27, 11, 2263-2273, https://doi.org/10.1023/A:1012283005014
. [all data]
Hedin, McKibben, et al., 2000
Hedin, P.A.; McKibben, G.H.; Dollar, D.A.,
Role of ground trash volatiles in the selection of hibernation sites by boll weevils,
J. Agric. Food Chem., 2000, 48, 8, 3673-3676, https://doi.org/10.1021/jf991001h
. [all data]
Novak, Novak, et al., 2000
Novak, J.; Novak, S.; Bitsch, C.; Franz, C.M.,
Essential oil composition of underground parts of Valeriana celtica ssp. from Austria and Italy,
Flavour Fragr. J., 2000, 15, 1, 40-42, https://doi.org/10.1002/(SICI)1099-1026(200001/02)15:1<40::AID-FFJ863>3.0.CO;2-B
. [all data]
Tamura, Boonbumrung, et al., 2000
Tamura, H.; Boonbumrung, S.; Yoshizawa, T.; Varanyanond, W.,
Volatile components of the essential oil in the pulp of four yellow mangoes (Mangifera indica L.) in Thailand,
Food Sci. Technol. Res., 2000, 6, 1, 68-73, https://doi.org/10.3136/fstr.6.68
. [all data]
Bos, Woerdenbag, et al., 1997
Bos, R.; Woerdenbag, H.J.; Hendriks, H.; Smit, H.F.; Wikström, H.V.; Scheffer, J.J.C.,
Composition of the essential oil from roots and rhizomes of Valeriana wallichii DC,
Flavour Fragr. J., 1997, 12, 2, 123-131, https://doi.org/10.1002/(SICI)1099-1026(199703)12:2<123::AID-FFJ613>3.0.CO;2-4
. [all data]
Bos, Woerdenbag, et al., 1997, 2
Bos, R.; Woerdenbag, H.J.; Hendriks, H.; Scheffer, J.J.C.,
Composition of the essential oils from underground parts of Valeriana officinalis L. s.l. and several closely related taxa,
Flavour Fragr. J., 1997, 12, 5, 359-370, https://doi.org/10.1002/(SICI)1099-1026(199709/10)12:5<359::AID-FFJ660>3.0.CO;2-G
. [all data]
Elias, Simoneit, et al., 1997
Elias, V.O.; Simoneit, B.R.T.; Cardoso, J.N.,
Analysis of volatile sesquiterpenoids in environmental and geological samples,
J. Hi. Res. Chromatogr., 1997, 20, 6, 305-309, https://doi.org/10.1002/jhrc.1240200602
. [all data]
Reverchon, Porta, et al., 1997
Reverchon, E.; Porta, G.D.; Gorgoglione, D.,
Supercritical CO2 extraction of volatile oil from rose concrete,
Flavour Fragr. J., 1997, 12, 1, 37-41, https://doi.org/10.1002/(SICI)1099-1026(199701)12:1<37::AID-FFJ605>3.0.CO;2-V
. [all data]
Tellez, Estell, et al., 1997
Tellez, M.R.; Estell, R.E.; Frederickson, E.L.; Havstad, K.M.,
Essntial oil of Flourensia cernua DC,
J. Essent. Oil Res., 1997, 9, 6, 619-624, https://doi.org/10.1080/10412905.1997.9700799
. [all data]
Chacko, Jayalekshmy, et al., 1996
Chacko, S.; Jayalekshmy, A.; Gopalakrishnan, M.; Narayanan, C.S.,
Roasting studies on black pepper (Piper nigrum L.),
Flavour Fragr. J., 1996, 11, 5, 305-310, https://doi.org/10.1002/(SICI)1099-1026(199609)11:5<305::AID-FFJ588>3.0.CO;2-1
. [all data]
Orav, Kailas, et al., 1996
Orav, A.; Kailas, T.; Liiv, M.,
Analysis of terpenoic composition of conifer needle oils by steam distillation/extraction, gas chromatography and gas chromatography-mass spectrometry,
Chromatographia, 1996, 43, 3/4, 215-219, https://doi.org/10.1007/BF02292955
. [all data]
Stashenko, Puertas, et al., 1996
Stashenko, E.E.; Puertas, M.A.; Combariza, M.Y.,
Volatile secondary metabolites from Spilanthes americana obtained by simultaneous steam distillation--solvent extraction and supercritical fluid extraction,
J. Chromatogr. A, 1996, 752, 1-2, 223-232, https://doi.org/10.1016/S0021-9673(96)00480-3
. [all data]
Gopalakrishnan, Menon, et al., 1993
Gopalakrishnan, M.; Menon, N.; Padmakumari, K.P.; Jayalekshmy, A.; Narayanan, C.S.,
GC Analysis and Odor Profiles of Four New Indian Genotypes of Piper nigrum L.,
J. Essent. Oil Res., 1993, 5, 3, 247-253, https://doi.org/10.1080/10412905.1993.9698217
. [all data]
Mallavarapu, Ramesh, et al., 1993
Mallavarapu, G.R.; Ramesh, S.; Kaul, P.N.; Battacharya, A.K.; Rao, B.R.R.,
The essential oil of Hyptis suaveolens (L.) Poit.,
J. Essent. Oil Res., 1993, 5, 3, 321-323, https://doi.org/10.1080/10412905.1993.9698230
. [all data]
Kollmannsberger, Nitz, et al., 1992
Kollmannsberger, H.; Nitz, S.; Drawert, F.,
UBer die Aromastoffzusammensetzung von Hochdruckextrakten. I. Pfeffer (Piper nigrum, Var. muntok),
Z. Lebensm. Unters Forsch., 1992, 194, 6, 545-551, https://doi.org/10.1007/BF01185481
. [all data]
Yang and Sugisawa, 1990
Yang, R.; Sugisawa, H.,
Citrus Suachi Hort. ex Shirai. Volatile components in Sudachi (Citrus Sudachi Hort. ex Shirai) juice,
Nippon Shokuhin Kogyo Gakkaishi, 1990, 37, 12, 946-952, https://doi.org/10.3136/nskkk1962.37.12_946
. [all data]
Ramaswami, Briscese, et al., 1988
Ramaswami, S.K.; Briscese, P.; Gargiullo, R.J.; von Geldern, T.,
Sesquiterpene hydrocarbons: from mass confusion to orderly line-up
in Flavors and Fragrances: A World Perspective. Proceedings of the 10th International Congress of Essential Oils, Fragrances and Flavors, Lawrence,B.M.; Mookherjee,B.D.; Willis,B.J., ed(s)., Elsevier, New York, 1988, 951-980. [all data]
Ramaswami, Briscese, et al., 1986
Ramaswami, S.K.; Briscese, P.; Gargiullo, R.J.; von Geldern, T.,
Sesquiterpene hydrocarbons: from mass confusion to orderly line-up
in Flavors and Fragrances: A World Perspective, Lawrence,B.M.; Mookherjee,B.D.; Willis,B.J., ed(s)., Proceedings of the 10th International Congress of Essential Oils, Fragrances, and Flavors, Washington, DC, 1986, 951-959. [all data]
Chaverri, Diaz, et al., 2011
Chaverri, C.; Diaz, C.; Cicco, J.F.,
Chemical analysis of essential oils from Ocotea gomezii W.C. Burger and Ocotea morae Gomez-Laur. (Lauraceae) collected at Reserva biologica Alberto M. Brenes in Costa Rica and their cytotoxic activity on Tumor cell lines,
J. Braz. Chem. Soc., 2011, 22, 4, s1-s4, https://doi.org/10.1590/S0103-50532011000400018
. [all data]
Karimi, Farmany, et al., 2011
Karimi, H.; Farmany, A.; Noorizadeh, H.,
Prediction of linear retention index of Teucrium chamaedrys volatiles in GCxGC-TOF/MS by linear model,
World Appl. Sci. J., 2011, 15, 8, 1086-1088. [all data]
Miyazaki, Plotto, et al., 2011
Miyazaki, T.; Plotto, A.; Goodner, K.; Gmitter F.G.,
Distribution of aroma volatile compounds in tangerine hybrids and proposed inheritance,
J. Sci. Food Agric., 2011, 91, 3, 449-460, https://doi.org/10.1002/jsfa.4205
. [all data]
Payo, Colo, et al., 2011
Payo, D.A.; Colo, J.; Calumpong, H.; de Clerck, O.,
Variability of non-polar secondary metabolites in the Red Alga Portieria,
Mar Drugs, 2011, 9, 11, 2438-2468, https://doi.org/10.3390/md9112438
. [all data]
Courtois, Paine, et al., 2009
Courtois, E.A.; Paine, C.E.; Blandinieres, P.-A.; Stien, D.; Bessiere, J.-M.; Houel, E.; Baraloto, C.; Chave, J.,
Diversity of the volatile organic compounds emitted by 55 species of tropical trees: a survey in French Guiana,
J. Chem. Ecol., 2009, 35, 11, 1349-1362, https://doi.org/10.1007/s10886-009-9718-1
. [all data]
Huang, Qin, et al., 2009
Huang, B.; Qin, L.; Chu, Q.; Zhang, Q.; Gao, L.; Zheng, H.,
Comparison of headspace SPME with hydrodistillation and SFE for analysis of the volatile components of the roots of Valeriana officinalis var. latifolia,
Chromatographia, 2009, 69, 5/6, 489-496, https://doi.org/10.1365/s10337-008-0921-y
. [all data]
Cole, Haber, et al., 2007
Cole, R.A.; Haber, W.A.; Setzer, W.N.,
Chemical composition of essential oils of seven species of Eugenia from Monteverde, Costa Rica,
Biochem. Syst. Ecol., 2007, 35, 12, 877-886, https://doi.org/10.1016/j.bse.2007.06.013
. [all data]
Meekijjaroenroj, Bessière, et al., 2007
Meekijjaroenroj, A.; Bessière, J.-M.; Anstett, M.-C.,
Chemistry of floral scents in four Licuala species (Arecaceae),
Flavour Fragr. J., 2007, 22, 4, 300-310, https://doi.org/10.1002/ffj.1797
. [all data]
Moriarity, Bansal, et al., 2007
Moriarity, D.M.; Bansal, A.; Cole, R.A.; Takaku, S.; Haber, W.A.; Setzer, W.N.,
Selective cytotoxic activities of leaf essential oils from Monteverde Costa Rica,
Natural Product Communications, 2007, 2, 12, 1263-1268. [all data]
Setzer, Stokes, et al., 2007
Setzer, W.N.; Stokes, S.L.; Penton, A.F.; Takaku, S.; Haber, W.A.; Hansell, E.; Caffrey, C.R.; McKerrow, J.H.,
Cruzain inhibitory activity of leaf essential oils of neotropical Lauraceae and essential oil components,
Natural Product Communications, 2007, 2, 12, 1203-1210. [all data]
Takaku, Haber, et al., 2007
Takaku, S.; Haber, W.A.; Setzer, W.N.,
Leaf essential oil composition of 10 species of Ocotea (Lauraceae) from Monteverde, Costa Rica,
Biochem. Syst. Ecol., 2007, 35, 8, 525-532, https://doi.org/10.1016/j.bse.2007.02.003
. [all data]
Deng, Xu, et al., 2006
Deng, C.; Xu, X.; Yao, N.; Li, N.; Zhang, X.,
Rapid determination of essential oil compounds in Artemisia Selengensis Turcz by gas chromatography-mass spectrometry with microwave distillation and simultaneous solid-phase microextraction,
Anal. Chim. Acta., 2006, 556, 2, 289-294, https://doi.org/10.1016/j.aca.2005.09.038
. [all data]
Li, Deng, et al., 2006
Li, N.; Deng, C.; Li, Y.; Ye, H.; Zhang, X.,
Gas chromatography-mass spectrometry following microwave distillation and headspace solid-phase microextraction for fast analysis of essential oil in dry traditional Chinese medicine,
J. Chromatogr. A, 2006, 1133, 1-2, 29-34, https://doi.org/10.1016/j.chroma.2006.08.046
. [all data]
de Lima, Maia, et al., 2006
de Lima, M.G.A.; Maia, I.C.C.; de Sousa, M.D.; de Morais, S.M.; Freitas, S.M.,
Effect of stalk and leaf extracts from euphorbiaceae species on Aedes aegypti (Diptera, culicidae) larvae,
Rev. Inst. Med. trop. S. Paulo, 2006, 48, 4, 211-214, https://doi.org/10.1590/S0036-46652006000400007
. [all data]
Hamm, Bleton, et al., 2005
Hamm, S.; Bleton, J.; Connan, J.; Tchapla, A.,
A chemical investigation by headspace SPME and GC-MS of volatile and semi-volatile terpenes in various olibanum samples,
Phytochemistry, 2005, 66, 12, 1499-1514, https://doi.org/10.1016/j.phytochem.2005.04.025
. [all data]
Deng, Li, et al., 2004
Deng, C.; Li, N.; Zhang, X.,
Rapid determination of essential oil in Acorus tatarinowii Schott. by pressurized hot water extraction followed by solid-phase microextraction and gas chromatography-mass spectrometry,
J. Chromatogr. A, 2004, 1059, 1-2, 149-155, https://doi.org/10.1016/j.chroma.2004.10.005
. [all data]
Singh, Marimuthu, et al., 2004
Singh, G.; Marimuthu, P.; Catalan, C.; deLampasona, M.P.,
Chemical, antioxidant and antifungal activities of volatile oil of black pepper and its acetone extract,
J. Sci. Food Agric., 2004, 84, 14, 1878-1884, https://doi.org/10.1002/jsfa.1863
. [all data]
Tepe, Donmez, et al., 2004
Tepe, B.; Donmez, E.; Unlu, M.; Candan, F.; Daferera, D.; Vardar-Unlu, G.; Polissiou, M.; Sokmen, A.,
Antimicrobial and antioxidative activities of the essential oils and methanol extracts of Salvia cryptantha (Montbret et Aucher ex Benth.) and Salvia multicaulis (Vahl),
Food Chem., 2004, 84, 4, 519-525, https://doi.org/10.1016/S0308-8146(03)00267-X
. [all data]
Vinogradov, 2004
Vinogradov, B.A.,
Production, composition, properties and application of essential oils, 2004, retrieved from http://viness.narod.ru. [all data]
Hamm, Lesellier, et al., 2003
Hamm, S.; Lesellier, E.; Bleton, J.; Tchapla, A.,
Optimization of headspace solid phase microextraction for gas chromatography/mass spectrometry analysis of widely different volatility and polarity terpenoids in olibanum,
J. Chromatogr. A, 2003, 1018, 1, 73-83, https://doi.org/10.1016/j.chroma.2003.08.027
. [all data]
Mockute, Nivinskiene, et al., 2003
Mockute, D.; Nivinskiene, O.; Bernotiene, G.; Butkiene, R.,
The cis-thujone chemotype of Salvia officinalis L. essential oils,
Chemija, 2003, 14, 4, 216-220. [all data]
Andrade, Maia, et al., 2000
Andrade, E.H.A.; Maia, J.G.S.; Zoghbi, M.G.B.,
Aroma volatile constituents of Brazilian varieties of mango fruit,
J. Food Comp. Anal., 2000, 13, 1, 27-33, https://doi.org/10.1006/jfca.1999.0841
. [all data]
Sagrero-Nieves and Bartley, 1995
Sagrero-Nieves, L.; Bartley, J.P.,
Volatile Constituents from the Leaves of Chenopodium ambrosioides L.,
J. Essent. Oil Res., 1995, 7, 2, 221-223, https://doi.org/10.1080/10412905.1995.9698506
. [all data]
Ishihara, Tsuneya, et al., 1993
Ishihara, M.; Tsuneya, T.; Uneyama, K.,
Components of the Volatile Concentrate of Agarwood,
J. Essent. Oil Res., 1993, 5, 3, 283-289, https://doi.org/10.1080/10412905.1993.9698221
. [all data]
Hymete, Rohloff, et al., 2007
Hymete, A.; Rohloff, J.; Iversen, T.-H.; Kjosen, H.,
Volatile constituents of the roots of Echinops kebericho Mesfin,
Flavour Fragr. J., 2007, 22, 1, 35-38, https://doi.org/10.1002/ffj.1746
. [all data]
Joichi, Yomogida, et al., 2005
Joichi, A.; Yomogida, K.; Awano, K.; Ueda, Y.,
Volatile components of tea-scented modern roses and ancient Chinese roses,
Flavour Fragr. J., 2005, 20, 2, 152-157, https://doi.org/10.1002/ffj.1388
. [all data]
Lourens, Reddy, et al., 2004
Lourens, A.C.U.; Reddy, D.; Baser, K.H.C.; Viljoen, A.M.; Van Vuuren, S.F.,
In vitro Biological Activity and Essential Oil Composition of Four Indigenous South Africal Helichrysum Species,
J. Ethnopharmacol., 2004, 95, 2-3, 253-258, https://doi.org/10.1016/j.jep.2004.07.027
. [all data]
Gaydou, Faure, et al., 1989
Gaydou, E.M.; Faure, R.; Bianchini, J.-P.; Lamaty, G.; Rakotonirainy, O.; Randriamiharisoa, R.,
Sesquiterpene composition of basil oil. Assignment of the 1H and 13C NMR spectra of β-elemene with two-dimensional NMR,
J. Agric. Food Chem., 1989, 37, 4, 1032-1037, https://doi.org/10.1021/jf00088a048
. [all data]
Bardakci, Demirci, et al., 2012
Bardakci, H.; Demirci, B.; Yesilada, E.; Kirmizibekmez, H.; Naser, K.H.C.,
Chemical composition of the essential oil of the subterranean parts of Valeriana alliariifolia,
Rec. Nat. Prod., 2012, 6, 1, 89-92. [all data]
Erdurak, Coskun, et al., 2006
Erdurak, C.S.; Coskun, M.; Demirci, B.; Baser, K.H.C.,
Composition of the essential oil of fruits and roots of Ferulago isaurica Pesmen and F. syriaca Boiss. (Umbelliferae) from Turkey,
Flavour Fragr. J., 2006, 21, 1, 118-121, https://doi.org/10.1002/ffj.1540
. [all data]
Baser, Demirei, et al., 2002
Baser, K.H.C.; Demirei, B.; Özek, T.; Akalin, E.; Özhatay, N.,
Micro-distilled volatile compounds from Ferulago species growing in Western Turkey,
Pharm. Biol., 2002, 40, 6, 466-471, https://doi.org/10.1076/phbi.40.6.466.8439
. [all data]