m-Trifluoromethylbenzonitrile
- Formula: C8H4F3N
- Molecular weight: 171.1193
- IUPAC Standard InChIKey: OGOBINRVCUWLGN-UHFFFAOYSA-N
- CAS Registry Number: 368-77-4
- Chemical structure:
View 3d structure (requires JavaScript / HTML 5) - Other names: α,α,α-Trifluoro-m-tolunitrile; 3-Trifluoromethylbenzonitrile; Benzonitrile, 3-(trifluoromethyl)-; 3-(CF3)-C6H4-CN; α,α,α-trifluoro-m-toluonitrile

Phase change data

Data compiled by: Robert L. Brown and Stephen E. Stein
Quantity | Value | Units | Method | Reference | Comment |
---|---|---|---|---|---|
Tboil | 462. | K | N/A | PCR Inc., 1990 | |
Tboil | 462.2 | K | N/A | Weast and Grasselli, 1989 |

Gas phase ion energetics data

Data evaluated as indicated in comments:
HL - Edward P. Hunter and Sharon G. Lias
Data compiled as indicated in comments:
B - John E. Bartmess
Quantity | Value | Units | Method | Reference | Comment |
---|---|---|---|---|---|
Proton affinity (review) | 791.4 | kJ/mol | N/A | Hunter and Lias, 1998 | HL |
Quantity | Value | Units | Method | Reference | Comment |
Gas basicity | 760.8 | kJ/mol | N/A | Hunter and Lias, 1998 | HL |
Electron affinity determinations
EA (eV) | Method | Reference | Comment |
---|---|---|---|
0.67 ± 0.10 | IMRE | Chowdhury and Kebarle, 1986 | ΔGea(423 K) = -15.5 kcal/mol; ΔSea (estimated) = 0. eu.; B |

References

PCR Inc., 1990
PCR Inc.,
Research Chemicals Catalog 1990-1991, PCR Inc., Gainesville, FL, 1990, 1. [all data]
Weast and Grasselli, 1989
CRC Handbook of Data on Organic Compounds, 2nd Editon, Weast,R.C and Grasselli, J.G., ed(s)., CRC Press, Inc., Boca Raton, FL, 1989, 1. [all data]
Hunter and Lias, 1998
Hunter, E.P.; Lias, S.G.,
Evaluated Gas Phase Basicities and Proton Affinities of Molecules: An Update,
J. Phys. Chem. Ref. Data, 1998, 27, 3, 413-656, https://doi.org/10.1063/1.556018
. [all data]
Chowdhury and Kebarle, 1986
Chowdhury, S.; Kebarle, P.,
Electron affinities of di- and tetracyanoethylene and cyanobenzenes based on measurements of gas-phase electron transfer equilibria,
J. Am. Chem. Soc., 1986, 108, 5453. [all data]