Benzoic acid, 2-ethoxy-, methyl ester
- Formula: C10H12O3
- Molecular weight: 180.2005
- IUPAC Standard InChIKey: QAYQKAPOTVSWLS-UHFFFAOYSA-N
- CAS Registry Number: 3686-55-3
- Chemical structure:
View 3d structure (requires JavaScript / HTML 5) - Other names: Benzoic acid, o-ethoxy-, methyl ester; Methyl o-ethoxybenzoate; R 172 (The insectifuge); Methyl 2-ethoxybenzoate; R 172

Kovats' RI, non-polar column, isothermal

Column type | Active phase | Temperature (C) | I | Reference | Comment |
---|---|---|---|---|---|
Capillary | Apiezon L | 190. | 1347. | Kováts, 1987 | |
Capillary | Apiezon L | 190. | 1351. | Kováts, 1987 |

Van Den Dool and Kratz RI, non-polar column, temperature ramp

Column type | Active phase | I | Reference | Comment |
---|---|---|---|---|
Capillary | VF-5MS | 1394. | Todua, 2011 | 30. m/0.25 mm/0.25 μm, He; Tstart: 60. C; Tend: 270. C |

References

Kováts, 1987
Kováts, E.,
Composition of essential oils. Part 7. Bulgarian oil of rose (Rosa damascena Mill.),
J. Chromatogr., 1987, 406, 185-222. [all data]
Todua, 2011
Todua, N.G.,
Retention Data. NIST Mass Spectrometry Data Center., NIST Mass Spectrometry Data Center, 2011. [all data]