cyclohexane, 4,5-dimethyl-, cis-
- Formula: C8H14
- Molecular weight: 110.1968
- IUPAC Standard InChIKey: KVZJLSYJROEPSQ-OCAPTIKFSA-N
- CAS Registry Number: 3685-00-5
- Chemical structure:
View 3d structure (requires JavaScript / HTML 5) - Species with the same structure:
- Stereoisomers:

Phase change data

Data compiled by: Thermodynamics Research Center, NIST Boulder Laboratories, Chris Muzny director
Quantity | Value | Units | Method | Reference | Comment |
---|---|---|---|---|---|
Tboil | 400.95 | K | N/A | Doering, Farber, et al., 1952 | Uncertainty assigned by TRC = 1.5 K |

References

Doering, Farber, et al., 1952
Doering, W. vonE.; Farber, M.; Sayigh, A.,
The Oxidative Bisdecarboxylation of α,β-Dicarboxylic Acids,
J. Am. Chem. Soc., 1952, 74, 4370. [all data]