Benzo[b]naphtho[2,3]thiophene, 4-methyl
- Formula: C17H12S
- Molecular weight: 248.342
- IUPAC Standard InChIKey: YTNVYFJVEVMZDG-UHFFFAOYSA-N
- CAS Registry Number: 36821-08-6
- Chemical structure:
View 3d structure (requires JavaScript / HTML 5) - Other names: Benzo[b]naphtho[2,3-d]thiophene, 4-methyl

Lee's RI, non-polar column, temperature ramp

Column type | Active phase | I | Reference | Comment |
---|---|---|---|---|
Capillary | SE-52 | 411.60 | Vassilaros, Kong, et al., 1982 | 20. m/0.30 mm/0.25 μm, H2, 40. C @ 2. min, 4. K/min; Tend: 265. C |

Lee's RI, non-polar column, custom temperature program

Column type | Active phase | I | Reference | Comment |
---|---|---|---|---|
Capillary | DB-5 | 410.66 | Mössner, de Alda, et al., 1999 | 60. m/0.25 mm/0.25 μm, He; Program: 60C (1 min) => 45 C/min => 150C (2 min) => 2 C/min => 300 C (25 min) |

References

Vassilaros, Kong, et al., 1982
Vassilaros, D.L.; Kong, R.C.; Later, D.W.; Lee, M.L.,
Linear retention index system for polycyclic aromatic compounds. Critical evaluation and additional indices,
J. Chromatogr., 1982, 252, 1-20, https://doi.org/10.1016/S0021-9673(01)88394-1
. [all data]
Mössner, de Alda, et al., 1999
Mössner, S.G.; de Alda, M.J.L.; Sander, L.C.; Lee, M.L.; Wise, S.A.,
Gas chromatographic retention behavior of polycyclic aromatic sulfur heterocyclic compounds, (dibenzothiophene, naphtho[b]thiophenes, benzo[b]naphthothiophenes and alkyl-substituted derivatives) on stationary phases of different selectivity,
J. Chromatogr. A, 1999, 841, 2, 207-228, https://doi.org/10.1016/S0021-9673(99)00363-5
. [all data]