3-Hexen-1-ol, acetate, (Z)-
- Formula: C8H14O2
- Molecular weight: 142.1956
- IUPAC Standard InChIKey: NPFVOOAXDOBMCE-PLNGDYQASA-N
- CAS Registry Number: 3681-71-8
- Chemical structure:
View 3d structure (requires JavaScript / HTML 5) - Isotopologues:
- Stereoisomers:
- Other names: cis-3-Hexenyl Acetate; cis-3-Hexenyl-1-acetate; Acetic acid cis-3-hexenyl ester; 3-Hexenol acetate, cis; 3(Z)-Hexenyl acetate; cis-3-Hexen-1-ol, acetate; cis-Hex-3-enyl acetate; Hex-3(Z)-enyl acetate; (Z)-3-Hexen-1-ol acetate; (Z)-3-Hexen-1-yl, acetate; (Z)-3-Hexenol acetate; (Z)-3-Hexenyl acetate; Z-Hex-3-en-1-yl acetate; (Z)-Hex-3-enyl acetate; (3Z)-3-Hexenyl acetate

Phase change data

Data compiled by: Robert L. Brown and Stephen E. Stein
Quantity | Value | Units | Method | Reference | Comment |
---|---|---|---|---|---|
Tboil | 442. | K | N/A | American Tokyo Kasei, 1988 |

Kovats' RI, non-polar column, isothermal

Data compiled by: NIST Mass Spectrometry Data Center, William E. Wallace, director

Column type CapillaryCapillaryPacked
Active phase SE-30SE-30SE-30
Column length (m)  40.3.7
Carrier gas   He
Substrate   Celatom silanized (62-72 mesh)
Column diameter (mm)  0.35
Phase thickness (μm)  0.35
Temperature (C) 100.100.150.
I 976.976.4978.
ReferenceTudor and Moldovan, 1999Tudor, 1997Ashes and Haken, 1975
Comment MSDC-RI MSDC-RI MSDC-RI

Normal alkane RI, polar column, temperature ramp

Data compiled by: NIST Mass Spectrometry Data Center, William E. Wallace, director

Column type CapillaryCapillaryCapillaryCapillaryCapillary
Active phase HP-20MDB-WaxTR-WAXDB-WaxTR-WAX
Column length (m) 50.30.60.30.60.
Carrier gas HeliumHeH2HeHe
Substrate
Column diameter (mm) 0.200.250.250.250.25
Phase thickness (μm) 0.200.250.250.250.25
Tstart (C) 60.30.40.40.40.
Tend (C) 220.210.200.230.200.
Heat rate (K/min) 2.5.3.4.3.
Initial hold (min)   10.2.10.
Final hold (min) 20. 10.5.
I 1290.1320.1316.1308.1316.
ReferenceBreme, Langle, et al., 2008Kumazawa, Itobe, et al., 2008Tena N., Lazzez A., et al., 2007Xu, Fan, et al., 2007Salas J.J., Garcia-Gonzalez D.L., et al., 2006
Comment MSDC-RI MSDC-RI MSDC-RI MSDC-RI MSDC-RI
Column type CapillaryCapillaryCapillaryCapillaryCapillary
Active phase InnowaxDB-WaxTR-WAXPEG-20MPEG-20M
Column length (m) 60.30.60.30.50.
Carrier gas HeHeH2
Substrate
Column diameter (mm) 0.250.250.250.250.20
Phase thickness (μm) 0.250.250.25 0.20
Tstart (C) 60.50.40.60.40.
Tend (C) 240.180.200.180.180.
Heat rate (K/min) 5.3.3.3.3.
Initial hold (min)   10.10.5.
Final hold (min) 30.40. 30.30.
I 1318.1309.1316.1320.1319.
ReferenceJoichi, Yomogida, et al., 2005Lee, Umano, et al., 2005Salas, Sánchez, et al., 2005Yao, Guo, et al., 2005Narain, Almeida, et al., 2004
Comment MSDC-RI MSDC-RI MSDC-RI MSDC-RI MSDC-RI
Column type CapillaryCapillaryCapillaryCapillaryCapillary
Active phase Supelcowax-10Supelcowax-10DB-WaxDB-WaxTC-WAX FFS
Column length (m) 30.30.60.60.60.
Carrier gas HeHeHe He
Substrate
Column diameter (mm) 0.250.250.250.250.25
Phase thickness (μm) 0.250.250.25
Tstart (C) 40.40.40.60.60.
Tend (C) 200.200.220.180.240.
Heat rate (K/min) 3.3.3.3.3.
Initial hold (min) 10.10.10.4.
Final hold (min)   10.
I 1316.1312.1314.1320.1314.
ReferenceVichi, Castellote, et al., 2003Vichi, Pizzale, et al., 2003Hayata, Sakamoto, et al., 2002Ito, Sugimoto, et al., 2002Miyazawa, Maehara, et al., 2002
Comment MSDC-RI MSDC-RI MSDC-RI MSDC-RI MSDC-RI
Column type CapillaryCapillaryCapillaryCapillaryCapillary
Active phase FFAPDB-WaxDB-WaxDB-WaxDB-Wax
Column length (m) 30.60.30.60.60.
Carrier gas H2 HeHeliumHe
Substrate
Column diameter (mm) 0.320.250.20.320.25
Phase thickness (μm) 0.250.25 0.250.25
Tstart (C) 40.30.50.50.40.
Tend (C) 240.170.180.230.200.
Heat rate (K/min) 3.2.3.5.2.
Initial hold (min) 5.4.8.2.2.
Final hold (min)  30.
I 1317.1312.1337.1318.1316.
ReferenceDucruet, Fournier, et al., 2001Buttery, Light, et al., 2000Franco and Shibamoto, 2000Paniandy, Chane-Ming, et al., 2000Umano, Hagi, et al., 2000
Comment MSDC-RI MSDC-RI MSDC-RI MSDC-RI MSDC-RI
Column type CapillaryCapillaryCapillaryCapillaryCapillary
Active phase DB-WaxDB-WaxCBP-20Supelcowax-10DB-Wax
Column length (m) 60.60.25.60.60.
Carrier gas HeHe HeHe
Substrate
Column diameter (mm) 0.250.250.250.250.25
Phase thickness (μm) 0.250.25 0.250.25
Tstart (C) 60.40.35.40.50.
Tend (C) 240.200.200.200.180.
Heat rate (K/min) 4.2.5.3.2.5
Initial hold (min)  2.5.3.5.
Final hold (min)    30.
I 1324.1314.1305.1317.1310.
ReferenceNgassoum, Yonkeu, et al., 1999Umano, Nakahara, et al., 1999Quiroz A. and Niemeyer H.M., 1998Wong and Lai, 1996Stashenko, Torres, et al., 1995
Comment MSDC-RI MSDC-RI MSDC-RI MSDC-RI MSDC-RI
Column type CapillaryCapillaryCapillaryCapillaryCapillary
Active phase CP-Wax 52CBDB-WaxSupelcowax-10DB-WaxDB-Wax
Column length (m) 50.60.60.60.60.
Carrier gas H2 He
Substrate
Column diameter (mm) 0.320.320.320.320.32
Phase thickness (μm) 0.22
Tstart (C) 50.50.60.50.50.
Tend (C) 200.230.220.230.250.
Heat rate (K/min) 2.4.2.4.4.
Initial hold (min) 5. 1.0.10.1
Final hold (min)  10. 10.5.
I 1313.11310.1336.1311.1310.
ReferenceChyau, Chen, et al., 1992Binder, Turner, et al., 1990Loughrin, Hamilton-Kemp, et al., 1990Binder, Flath, et al., 1989Binder and Flath, 1989
Comment MSDC-RI MSDC-RI MSDC-RI MSDC-RI MSDC-RI
Column type CapillaryCapillaryCapillaryCapillaryCapillary
Active phase Supelcowax-10DB-WaxSupelcowax-10Carbowax 20MCarbowax 20M
Column length (m) 60.60.60.50.50.
Carrier gas HeHe N2N2
Substrate
Column diameter (mm) 0.320.3220.320.220.22
Phase thickness (μm)  0.25
Tstart (C) 60.50.60.80.80.
Tend (C) 220.230.220.200.200.
Heat rate (K/min) 2.4.3.3.3.
Initial hold (min) 1. 1.
Final hold (min) 30.
I 1337.1315.1333.1305.1307.
ReferenceAndersen, Hamilton-Kemp, et al., 1988Engel, Flath, et al., 1988Hamilton-Kemp, Andersen, et al., 1988Mihara, Tateba, et al., 1988Mihara, Tateba, et al., 1988
Comment MSDC-RI MSDC-RI MSDC-RI MSDC-RI MSDC-RI
Column type CapillaryCapillaryCapillaryCapillaryCapillary
Active phase Carbowax 20MCarbowax 20MDB-WaxDB-WaxCarbowax 20M
Column length (m) 50.50.60.60.50.
Carrier gas N2N2H2H2N2
Substrate
Column diameter (mm) 0.220.220.250.250.22
Phase thickness (μm)   0.250.25
Tstart (C) 80.80.30.30.80.
Tend (C) 200.200.180.180.200.
Heat rate (K/min) 3.3.2.2.3.
Initial hold (min)   2.2.
Final hold (min)
I 1305.1307.1315.1315.1305.
ReferenceMihara, Tateba, et al., 1988Mihara, Tateba, et al., 1988Takeoka, Flath, et al., 1988Takeoka, Flath, et al., 1988Mihara, Tateba, et al., 1987
Comment MSDC-RI MSDC-RI MSDC-RI MSDC-RI MSDC-RI
Column type CapillaryCapillaryCapillaryCapillaryCapillary
Active phase Carbowax 20MCarbowax 20MCarbowax 20MCarbowax 20MCarbowax 20M
Column length (m) 50.50.50.150.150.
Carrier gas N2N2N2
Substrate
Column diameter (mm) 0.220.220.220.660.64
Phase thickness (μm)
Tstart (C) 80.80.80.60.50.
Tend (C) 200.200.200.170.170.
Heat rate (K/min) 3.3.3.1.1.
Initial hold (min)    40.
Final hold (min)     30.
I 1307.1305.1307.1310.1310.
ReferenceMihara, Tateba, et al., 1987Mihara, Tateba, et al., 1987Mihara, Tateba, et al., 1987Buttery, Xu, et al., 1985Buttery, Kamm, et al., 1984
Comment MSDC-RI MSDC-RI MSDC-RI MSDC-RI MSDC-RI
Column type CapillaryCapillary
Active phase Carbowax 20MCarbowax 20M
Column length (m) 150.150.
Carrier gas
Substrate
Column diameter (mm) 0.660.64
Phase thickness (μm)
Tstart (C) 60.50.
Tend (C) 170.170.
Heat rate (K/min) 1.1.
Initial hold (min) 40.30.
Final hold (min)
I 1310.1310.
ReferenceButtery and Ling, 1984Buttery and Kamm, 1980
Comment MSDC-RI MSDC-RI

Kovats' RI, polar column, temperature ramp

Data compiled by: NIST Mass Spectrometry Data Center, William E. Wallace, director

Column type CapillaryCapillaryCapillaryCapillaryCapillary
Active phase Supelcowax-10Supelcowax-10DB-WaxDB-WaxDB-Wax
Column length (m) 60.60.60.60.60.
Carrier gas HeHeHeHeHe
Substrate
Column diameter (mm) 0.250.250.250.250.25
Phase thickness (μm)   0.250.250.25
Tstart (C) 35.35.40.40.40.
Tend (C) 200.200.200.200.200.
Heat rate (K/min) 3.3.3.3.3.
Initial hold (min) 5.5.5.5.5.
Final hold (min) 20.20.
I 1315.1310.1320.1321.1319.
ReferenceWong and Teng, 1994Wong and Tie, 1993Tatsuka, Suekane, et al., 1990Tatsuka, Suekane, et al., 1990Tatsuka, Suekane, et al., 1990
Comment MSDC-RI MSDC-RI MSDC-RI MSDC-RI MSDC-RI
Column type CapillaryCapillaryCapillaryCapillaryCapillary
Active phase DB-WaxBP-20Carbowax 20MDB-WaxDB-Wax
Column length (m) 60.25.50.30.30.
Carrier gas He  N2N2
Substrate
Column diameter (mm) 0.250.320.220.250.25
Phase thickness (μm) 0.25
Tstart (C) 40.70.80.60.60.
Tend (C) 200.200.200.200.200.
Heat rate (K/min) 3.4.2.2.2.
Initial hold (min) 5.2. 10.10.
Final hold (min)
I 1321.1346.1311.1315.1317.
ReferenceTatsuka, Suekane, et al., 1990Wyllie and Leach, 1990Nishimura, Yamaguchi, et al., 1989Umano, Shoji, et al., 1986Umano, Shoji, et al., 1986
Comment MSDC-RI MSDC-RI MSDC-RI MSDC-RI MSDC-RI
Column type CapillaryCapillaryCapillaryCapillaryCapillary
Active phase Carbowax 20MCarbowax 20MCarbowax 20MCarbowax 20MCarbowax 20M
Column length (m) 59.50.50.150.150.
Carrier gas    HeHe
Substrate
Column diameter (mm) 0.250.230.230.640.64
Phase thickness (μm)
Tstart (C) 70.80.80.50.50.
Tend (C) 190.200.200.170.170.
Heat rate (K/min) 1.2.2.1.1.
Initial hold (min)    30.30.
Final hold (min)
I 1327.1313.1316.1310.1310.
ReferencePalma-Fleming and Kepner, 1983Toda, Mihara, et al., 1983Toda, Mihara, et al., 1983Buttery, Kamm, et al., 1982Buttery, Kamm, et al., 1982
Comment MSDC-RI MSDC-RI MSDC-RI MSDC-RI MSDC-RI
Column type CapillaryCapillaryCapillaryCapillary
Active phase Carbowax 20MCarbowax 20MCarbowax 20MCarbowax 20M
Column length (m) 150.150.30.30.
Carrier gas  HeN2N2
Substrate
Column diameter (mm) 0.640.640.260.26
Phase thickness (μm)
Tstart (C) 50.50.70.70.
Tend (C) 170.170.170.170.
Heat rate (K/min) 1.1.3.3.
Initial hold (min) 30.
Final hold (min)
I 1310.1310.1314.1314.
ReferenceButtery, Ling, et al., 1982Buttery, Seifert, et al., 1982Spencer, Pangborn, et al., 1978Spencer, Pangborn, et al., 1978
Comment MSDC-RI MSDC-RI MSDC-RI MSDC-RI

Van Den Dool and Kratz RI, polar column, custom temperature program

Data compiled by: NIST Mass Spectrometry Data Center, William E. Wallace, director

Column type CapillaryCapillaryCapillaryCapillaryCapillary
Active phase SOLGel-WaxSOLGel-WaxSOLGel-WaxStabilwaxStabilwax
Column length (m) 30.30.30.30.30.
Carrier gas HeHeHeHeHe
Substrate
Column diameter (mm) 0.250.250.250.320.32
Phase thickness (μm) 0.250.250.251.1.
Program 35C(5min) => 3C/min => 150C => 5C/min => 250C(10 min)35C(5min) => 3C/min => 150C => 5C/min => 250C (10min)35C(5min) => 3C/min => 150C => 5C/min => 250C (10min)40C(2min) => 5C/min => 100C => 4C/min => 230C (10min)40C(2min) => 5C/min => 100C => 4C/min => 230C (10min)
I 1298.1298.1298.1317.1338.
ReferenceAubert, Baumann, et al., 2005Aubert, Baumann, et al., 2005Aubert, Baumann, et al., 2005Wang, Finn, et al., 2005Wang, Finn, et al., 2005
Comment MSDC-RI MSDC-RI MSDC-RI MSDC-RI MSDC-RI
Column type CapillaryCapillaryCapillaryCapillary
Active phase StabilwaxHP-InnowaxFFAPHP-Innowax
Column length (m) 30.30.30.30.
Carrier gas HeHeHeHe
Substrate
Column diameter (mm) 0.320.320.320.25
Phase thickness (μm) 1.0.50.250.25
Program 40C (2min) => 5C/min => 100C => 4C/min => 230C (10min)40C(4min) => 10C/min => 70C => 5C/min => 150C => 10C/min => 250C (10min)35C (2min) => 40C/min => 60C => 4C/min => 230C (10min)60C(8min) => 3C/min => 180C(5min) => 40C/min => 250C
I 1338.1331.1321.1320.
ReferenceKlesk, Qian, et al., 2004Koprivnjak, Conte, et al., 2002Derail, Hofmann, et al., 1999Bisio, Ciarallo, et al., 1998
Comment MSDC-RI MSDC-RI MSDC-RI MSDC-RI

References

American Tokyo Kasei, 1988
American Tokyo Kasei,
TCI American Organic Chemical 88/89 Catalog, American Tokyo Kasei, Portland, OR, 1988, 1610. [all data]