Calcium hydroxide cation
- Formula: CaHO+
- Molecular weight: 57.085
- CAS Registry Number: 36812-31-4

Gas phase thermochemistry data

Quantity | Value | Units | Method | Reference | Comment |
---|---|---|---|---|---|
S°gas,1 bar | 229.91 | J/mol*K | Review | Chase, 1998 | Data last reviewed in December, 1975 |

Ion clustering data

Data compiled by: Michael M. Meot-Ner (Mautner) and Sharon G. Lias
Clustering reactions
By formula: HCaO+ + H2O = (HCaO+ • H2O)
Quantity | Value | Units | Method | Reference | Comment |
---|---|---|---|---|---|
ΔrH° | 144. | kJ/mol | MS | Burdett and Hayhurst, 1982 | gas phase; flame source, about 1600 K |
Quantity | Value | Units | Method | Reference | Comment |
ΔrS° | 90.0 | J/mol*K | MS | Burdett and Hayhurst, 1982 | gas phase; flame source, about 1600 K |

Reaction thermochemistry data

Data compiled by: Michael M. Meot-Ner (Mautner) and Sharon G. Lias

Individual Reactions

HCaO+ + Water = (HCaO+ • Water)

By formula: HCaO+ + H2O = (HCaO+ • H2O)

Quantity Value Units Method Reference Comment
Δr144.kJ/molMSBurdett and Hayhurst, 1982gas phase; flame source, about 1600 K
Quantity Value Units Method Reference Comment
Δr90.0J/mol*KMSBurdett and Hayhurst, 1982gas phase; flame source, about 1600 K

References

Chase, 1998
Chase, M.W., Jr.,
NIST-JANAF Themochemical Tables, Fourth Edition,
J. Phys. Chem. Ref. Data, Monograph 9, 1998, 1-1951. [all data]
Burdett and Hayhurst, 1982
Burdett, N.A.; Hayhurst, A.N.,
Hydration of gas phase ions and the measurement of boundary layer cooling during flame sampling into a mass spectrometer.,
J. Chem. Soc. Faraday Trans. 1, 1982, 78, 2997. [all data]