3-Pentynoic acid
- Formula: C5H6O2
- Molecular weight: 98.0999
- IUPAC Standard InChIKey: NIZKVZYBUGUDTI-UHFFFAOYSA-N
- CAS Registry Number: 36781-65-4
- Chemical structure:
View 3d structure (requires JavaScript / HTML 5) - Permanent link for this species. Use this link for bookmarking this species for future reference.

Reaction thermochemistry data

Data compiled by: Hussein Y. Afeefy, Joel F. Liebman, and Stephen E. Stein
Individual Reactions
By formula: 2H2 + C5H6O2 = C5H10O2
Quantity | Value | Units | Method | Reference | Comment |
---|---|---|---|---|---|
ΔrH° | -275. ± 5.0 | kJ/mol | Chyd | Flitcroft and Skinner, 1958 | liquid phase |

References

Flitcroft and Skinner, 1958
Flitcroft, T.L.; Skinner, H.A.,
Heats of hydrogenation Part 2.-Acetylene derivatives,
Trans. Faraday Soc., 1958, 54, 47-53. [all data]