Pentane, 3-ethoxy-
- Formula: C7H16O
- Molecular weight: 116.2013
- IUPAC Standard InChIKey: BMAINLNHNVARHJ-UHFFFAOYSA-N
- CAS Registry Number: 36749-13-0
- Chemical structure:
View 3d structure (requires JavaScript / HTML 5) - Other names: Ethyl 3-pentyl ether

Normal alkane RI, non-polar column, custom temperature program

Column type | Active phase | I | Reference | Comment |
---|---|---|---|---|
Capillary | Polydimethyl siloxanes | 773. | Zenkevich, Chupalov, et al., 1996 | Program: not specified |

References

Zenkevich, Chupalov, et al., 1996
Zenkevich, I.G.; Chupalov, A.A.; Herzschuh, R.,
Correlation of the Increments of Gas Chromatographic Retention Indices with the Differences of Innermolecular Energies of Reagents and Products of Chemical Reactions,
Zh. Org. Khim. (Rus.), 1996, 32, 11, 1685-1691. [all data]