Quazepam
- Formula: C17H11ClF4N2S
- Molecular weight: 386.794
- IUPAC Standard InChIKey: IKMPWMZBZSAONZ-UHFFFAOYSA-N
- CAS Registry Number: 36735-22-5
- Chemical structure:
View 3d structure (requires JavaScript / HTML 5) - Other names: 2H-1,4-Benzodiazepine-2-thione, 7-chloro-5-(2-fluorophenyl)-1,3-dihydro-1-(2,2,2-trifluoroethyl)-; Sch 16134; 7-Chloro-5-(o-fluorophenyl)-1,3-dihydro-1-(2,2,2-trifluoroethyl)-2H-1,4-benzodiazepine-2-thione; Dormalin; Doral; Oniria; Prosedar; Quazium; Selepam

Kovats' RI, non-polar column, custom temperature program

Column type | Active phase | I | Reference | Comment |
---|---|---|---|---|
Capillary | OV-1 | 2485. | Schütz, 1988 | Program: not specified |

References

Schütz, 1988
Schütz, H.,
Modern screening strategies in analytical toxicology with special regard to new benzodiazepines,
Z. Rechtsmed., 1988, 100, 1, 19-37, https://doi.org/10.1007/BF00200362
. [all data]