2,4-Difluoroaniline
- Formula: C6H5F2N
- Molecular weight: 129.1074
- IUPAC Standard InChIKey: CEPCPXLLFXPZGW-UHFFFAOYSA-N
- CAS Registry Number: 367-25-9
- Chemical structure:
View 3d structure (requires JavaScript / HTML 5) - Other names: Benzenamine, 2,4-difluoro-; Aniline, 2,4-difluoro-

Phase change data

Data compiled as indicated in comments:
BS - Robert L. Brown and Stephen E. Stein
AC - William E. Acree, Jr., James S. Chickos
Quantity | Value | Units | Method | Reference | Comment |
---|---|---|---|---|---|
Tboil | 442.6 | K | N/A | PCR Inc., 1990 | BS |
Quantity | Value | Units | Method | Reference | Comment |
ΔvapH° | 52.1 ± 0.5 | kJ/mol | C | Ribeiro da Silva, Ferreira, et al., 2007 | AC |
Reduced pressure boiling point
Tboil (K) | Pressure (bar) | Reference | Comment |
---|---|---|---|
443.2 | 1.00 | Weast and Grasselli, 1989 | BS |

Reaction thermochemistry data

Data compiled by: John E. Bartmess
Individual Reactions
C6H4F2N- + =
By formula: C6H4F2N- + H+ = C6H5F2N
Quantity | Value | Units | Method | Reference | Comment |
---|---|---|---|---|---|
ΔrH° | 1510. ± 9.2 | kJ/mol | G+TS | Bartmess, Scott, et al., 1979 | gas phase; value altered from reference due to change in acidity scale |
Quantity | Value | Units | Method | Reference | Comment |
ΔrG° | 1480. ± 8.4 | kJ/mol | IMRE | Bartmess, Scott, et al., 1979 | gas phase; value altered from reference due to change in acidity scale |

References

PCR Inc., 1990
PCR Inc.,
Research Chemicals Catalog 1990-1991, PCR Inc., Gainesville, FL, 1990, 1. [all data]
Ribeiro da Silva, Ferreira, et al., 2007
Ribeiro da Silva, Manuel A.V.; Ferreira, Ana I.M.C.L.; Gomes, José R.B.,
Combined Experimental and Computational Study of the Thermochemistry of the Fluoroaniline Isomers,
J. Phys. Chem. B, 2007, 111, 8, 2052-2061, https://doi.org/10.1021/jp0672407
. [all data]
Weast and Grasselli, 1989
CRC Handbook of Data on Organic Compounds, 2nd Editon, Weast,R.C and Grasselli, J.G., ed(s)., CRC Press, Inc., Boca Raton, FL, 1989, 1. [all data]
Bartmess, Scott, et al., 1979
Bartmess, J.E.; Scott, J.A.; McIver, R.T., Jr.,
The gas phase acidity scale from methanol to phenol,
J. Am. Chem. Soc., 1979, 101, 6047. [all data]