decyl benzoate
- Formula: C17H26O2
- Molecular weight: 262.3871
- IUPAC Standard InChIKey: CUSUFTNOPPMGBK-UHFFFAOYSA-N
- CAS Registry Number: 36685-97-9
- Chemical structure:
View 3d structure (requires JavaScript / HTML 5) - Other names: Benzoic acid, decyl ester; n-decyl benzoate

Kovats' RI, non-polar column, isothermal

Column type | Active phase | Temperature (C) | I | Reference | Comment |
---|---|---|---|---|---|
Capillary | DB-1 | 170. | 1977.32 | Mijin and Antonovic, 2006 | 30. m/0.256 mm/0.25 μm, N2 |
Capillary | DB-5 | 170. | 2003.36 | Mijin and Antonovic, 2006 | 60. m/0.321 mm/0.25 μm, N2 |
Capillary | SE-30 | 160. | 1957. | Korhonen, 1986 | N2; Column length: 25. m; Column diameter: 0.33 mm |
Capillary | SE-30 | 180. | 1959. | Korhonen, 1986 | N2; Column length: 25. m; Column diameter: 0.33 mm |
Capillary | SE-30 | 200. | 1964. | Korhonen, 1986 | N2; Column length: 25. m; Column diameter: 0.33 mm |
Capillary | SE-30 | 220. | 1977. | Korhonen, 1986 | N2; Column length: 25. m; Column diameter: 0.33 mm |
Capillary | SE-30 | 240. | 1981. | Korhonen, 1986 | N2; Column length: 25. m; Column diameter: 0.33 mm |
Capillary | SE-30 | 160. | 1955. | Korhonen and Lind, 1985 | N2; Column length: 25. m; Column diameter: 0.33 mm |
Capillary | SE-30 | 180. | 1964. | Korhonen and Lind, 1985 | N2; Column length: 25. m; Column diameter: 0.33 mm |
Capillary | SE-30 | 200. | 1972. | Korhonen and Lind, 1985 | N2; Column length: 25. m; Column diameter: 0.33 mm |

Kovats' RI, polar column, isothermal

Column type | Active phase | Temperature (C) | I | Reference | Comment |
---|---|---|---|---|---|
Capillary | OV-351 | 180. | 2474. | Korhonen, 1986 | N2; Column length: 25. m; Column diameter: 0.32 mm |
Capillary | OV-351 | 200. | 2500. | Korhonen, 1986 | N2; Column length: 25. m; Column diameter: 0.32 mm |
Capillary | OV-351 | 220. | 2504. | Korhonen, 1986 | N2; Column length: 25. m; Column diameter: 0.32 mm |
Capillary | OV-351 | 160. | 2475. | Korhonen and Lind, 1985 | N2; Column length: 25. m; Column diameter: 0.32 mm |
Capillary | OV-351 | 180. | 2488. | Korhonen and Lind, 1985 | N2; Column length: 25. m; Column diameter: 0.32 mm |
Capillary | OV-351 | 200. | 2506. | Korhonen and Lind, 1985 | N2; Column length: 25. m; Column diameter: 0.32 mm |

Van Den Dool and Kratz RI, non-polar column, temperature ramp

Column type | Active phase | I | Reference | Comment |
---|---|---|---|---|
Capillary | SE-30 | 1965. | Korhonen, 1986 | N2, 6. K/min; Column length: 25. m; Column diameter: 0.33 mm; Tstart: 100. C; Tend: 310. C |
Capillary | SE-30 | 1980. | Korhonen and Lind, 1985 | N2, 10. K/min; Column length: 25. m; Column diameter: 0.33 mm; Tstart: 100. C; Tend: 320. C |
Capillary | SE-30 | 1960. | Korhonen and Lind, 1985 | N2, 2. K/min; Column length: 25. m; Column diameter: 0.33 mm; Tstart: 100. C; Tend: 320. C |
Capillary | SE-30 | 1973. | Korhonen and Lind, 1985 | N2, 6. K/min; Column length: 25. m; Column diameter: 0.33 mm; Tstart: 100. C; Tend: 320. C |

Van Den Dool and Kratz RI, non-polar column, custom temperature program

Column type | Active phase | I | Reference | Comment |
---|---|---|---|---|
Packed | SE-30 | 1972. | Peng, Ding, et al., 1988 | Supelcoport; Chromosorb; Column length: 3.05 m; Program: 40C(5min) => 10C/min => 200C or 250C (60min) |

Van Den Dool and Kratz RI, polar column, temperature ramp

Column type | Active phase | I | Reference | Comment |
---|---|---|---|---|
Capillary | OV-351 | 2473. | Korhonen, 1986 | N2, 6. K/min; Column length: 25. m; Column diameter: 0.32 mm; Tstart: 100. C; Tend: 220. C |
Capillary | OV-351 | 2494. | Korhonen and Lind, 1985 | N2, 10. K/min; Column length: 25. m; Column diameter: 0.32 mm; Tstart: 100. C; Tend: 230. C |
Capillary | OV-351 | 2464. | Korhonen and Lind, 1985 | N2, 2. K/min; Column length: 25. m; Column diameter: 0.32 mm; Tstart: 100. C; Tend: 230. C |
Capillary | OV-351 | 2486. | Korhonen and Lind, 1985 | N2, 6. K/min; Column length: 25. m; Column diameter: 0.32 mm; Tstart: 100. C; Tend: 230. C |

Normal alkane RI, polar column, custom temperature program

Column type | Active phase | I | Reference | Comment |
---|---|---|---|---|
Capillary | DB-Wax | 2519. | Peng, Yang, et al., 1991 | Program: not specified |

References

Mijin and Antonovic, 2006
Mijin, D.; Antonovic, D.G.,
The temperature dependence of the retention index for n-alkyl esters of acetic, propionic, cyclohexanecarboxylic, benzoic and phenylacetic acid on DB-1 and DB-5 capillary columns,
J. Serb. Chem. Soc., 2006, 71, 6, 629-637, https://doi.org/10.2298/JSC0606629M
. [all data]
Korhonen, 1986
Korhonen, I.O.O.,
Gas-Liquid Chromatographic Analyses. XLV. Retention Behaviour of C1-C12 n-Alkyl Esters of Benzoic, 4-Nitrobenzoic and 3,5-Dinitrobenzoic Acids on SE-30 and OV-351 Capillary Columns,
J. Chromatogr., 1986, 356, 285-299, https://doi.org/10.1016/S0021-9673(00)91489-4
. [all data]
Korhonen and Lind, 1985
Korhonen, I.O.O.; Lind, M.A.,
Gas-liquid chromatographic analyses. XXXV. Capillary column studies of C1-C12 n-alkyl esters of benzoic and monochlorobenzoic acids,
J. Chromatogr., 1985, 322, 83-96, https://doi.org/10.1016/S0021-9673(01)97661-7
. [all data]
Peng, Ding, et al., 1988
Peng, C.T.; Ding, S.F.; Hua, R.L.; Yang, Z.C.,
Prediction of Retention Indexes I. Structure-Retention Index Relationship on Apolar Columns,
J. Chromatogr., 1988, 436, 137-172, https://doi.org/10.1016/S0021-9673(00)94575-8
. [all data]
Peng, Yang, et al., 1991
Peng, C.T.; Yang, Z.C.; Ding, S.F.,
Prediction of rentention idexes. II. Structure-retention index relationship on polar columns,
J. Chromatogr., 1991, 586, 1, 85-112, https://doi.org/10.1016/0021-9673(91)80028-F
. [all data]