Cycloundecanecarboxylic acid, methyl ester
- Formula: C13H24O2
- Molecular weight: 212.3285
- IUPAC Standard InChIKey: WVHFSXDJALCJHN-UHFFFAOYSA-N
- CAS Registry Number: 3667-69-4
- Chemical structure:
View 3d structure (requires JavaScript / HTML 5) - Other names: Methyl cycloundecanecarboxylate

Normal alkane RI, non-polar column, temperature ramp

Column type | Active phase | I | Reference | Comment |
---|---|---|---|---|
Capillary | DB-5 | 1536. | Ali, Wurster, et al., 2008 | 30. m/0.25 mm/0.25 μm, Helium, 70. C @ 1. min, 3. K/min; Tend: 220. C |
Capillary | DB-5 | 1536. | Awadi Ali, Wurster, et al., 2008 | 70. C @ 1. min, 3. K/min; Column length: 30. m; Column diameter: 0.25 mm; Tend: 220. C |

References

Ali, Wurster, et al., 2008
Ali, N.A.A.; Wurster, M.; Arnold, N.; Teichert, A.; Schmidt, J.; Lindequist, U.; Wessjohann, L.,
Chemical composition and biological activities of essential oils from the oleogum resins of three endemic soqotraen Boswellia species,
Rec. Nat. Prod., 2008, 2, 1, 6-12. [all data]
Awadi Ali, Wurster, et al., 2008
Awadi Ali, N.A.; Wurster, M.; Arnold, N.; Teicher, A.; Schmidt, J.; Lindequist, U.; Wessjohann, L.,
Chemical composition and biological activity of essential oils from the Oleogum resins of three endemic soqotraen Boswellia species,
Rec. Nat. Prod., 2008, 2, 1, 6-12. [all data]