1-Hexadecanol
- Formula: C16H34O
- Molecular weight: 242.4406
- IUPAC Standard InChIKey: BXWNKGSJHAJOGX-UHFFFAOYSA-N
- CAS Registry Number: 36653-82-4
- Chemical structure:

Gas phase thermochemistry data

Data compiled as indicated in comments:
DRB - Donald R. Burgess, Jr.
ALS - Hussein Y. Afeefy, Joel F. Liebman, and Stephen E. Stein
GT - Glushko Thermocenter, Russian Academy of Sciences, Moscow
Quantity | Value | Units | Method | Reference | Comment |
---|---|---|---|---|---|
ΔfH°gas | -516.8 | kJ/mol | N/A | Mosselman and Dekker, 1975 | Value computed using ΔfHsolid° value of -686.4±0.4 kj/mol from Mosselman and Dekker, 1975 and ΔsubH° value of 169.6 kj/mol from Gundry, Harrop, et al., 1969.; DRB |
ΔfH°gas | -517.5 ± 3.2 | kJ/mol | Ccb | Gundry, Harrop, et al., 1969 | ALS |
ΔfH°gas | -513.7 | kJ/mol | N/A | Parks, Mosley, et al., 1950 | Value computed using ΔfHsolid° value of -683.3±3.8 kj/mol from Parks, Mosley, et al., 1950 and ΔsubH° value of 169.6 kj/mol from Gundry, Harrop, et al., 1969.; DRB |
Quantity | Value | Units | Method | Reference | Comment |
S°gas | 853. ± 17. | J/mol*K | N/A | Wilhoit R.C., 1973 | Other third-law entropy value at 298.15 K is 803(11) J/mol*K [ Green J.H.S., 1961]. Values calculated by a method of increments [ Green J.H.S., 1961, Thermodynamics Research Center, 1997] are equal to 831 and 832.5 J/mol*K, respectively.; GT |

Condensed phase thermochemistry data

Data compiled as indicated in comments:
DH - Eugene S. Domalski and Elizabeth D. Hearing
ALS - Hussein Y. Afeefy, Joel F. Liebman, and Stephen E. Stein
Quantity | Value | Units | Method | Reference | Comment |
---|---|---|---|---|---|
ΔfH°solid | -686.4 ± 0.4 | kJ/mol | Ccb | Mosselman and Dekker, 1975 | ALS |
ΔfH°solid | -687.1 ± 2.0 | kJ/mol | Ccb | Gundry, Harrop, et al., 1969 | ALS |
ΔfH°solid | -683.3 ± 3.8 | kJ/mol | Ccb | Parks, Mosley, et al., 1950 | Reanalyzed by Cox and Pilcher, 1970, Original value = -684.29 kJ/mol; see Richardson and Parks, 1939; ALS |
Quantity | Value | Units | Method | Reference | Comment |
ΔcH°solid | -10510. ± 8. | kJ/mol | Ccb | Freeman and Bagby, 1989 | Corresponding ΔfHºsolid = -644. kJ/mol (simple calculation by NIST; no Washburn corrections); ALS |
ΔcH°solid | -10468.9 ± 0.7 | kJ/mol | Ccb | Mosselman and Dekker, 1975 | Corresponding ΔfHºsolid = -686.4 kJ/mol (simple calculation by NIST; no Washburn corrections); ALS |
ΔcH°solid | -10486.3 ± 1.7 | kJ/mol | Ccb | Gundry, Harrop, et al., 1969 | Corresponding ΔfHºsolid = -669.01 kJ/mol (simple calculation by NIST; no Washburn corrections); ALS |
ΔcH°solid | -10471.9 ± 3.8 | kJ/mol | Ccb | Parks, Mosley, et al., 1950 | Reanalyzed by Cox and Pilcher, 1970, Original value = -10471.2 kJ/mol; see Richardson and Parks, 1939; Corresponding ΔfHºsolid = -683.33 kJ/mol (simple calculation by NIST; no Washburn corrections); ALS |
Quantity | Value | Units | Method | Reference | Comment |
S°solid,1 bar | 451.9 | J/mol*K | N/A | Parks, Kennedy, et al., 1956 | Extrapolation below 80 K, 115.3 J/mol*K.; DH |
Constant pressure heat capacity of liquid
Cp,liquid (J/mol*K) | Temperature (K) | Reference | Comment |
---|---|---|---|
618.2 | 333.15 | Khasanshin and Zykova, 1989 | T = 333 to 583 K.; DH |
524. | 323. | Mosselman, Mourik, et al., 1974 | T = 323 to 346 K.; DH |
Constant pressure heat capacity of solid
Cp,solid (J/mol*K) | Temperature (K) | Reference | Comment |
---|---|---|---|
422. | 298.15 | Mosselman, Mourik, et al., 1974 | T = 293 to 311 K.; DH |
441.24 | 290. | Parks, Kennedy, et al., 1956 | T = 80 to 290 K.; DH |

Phase change data

Data compiled as indicated in comments:
TRC - Thermodynamics Research Center, NIST Boulder Laboratories, Chris Muzny director
BS - Robert L. Brown and Stephen E. Stein
AC - William E. Acree, Jr., James S. Chickos
ALS - Hussein Y. Afeefy, Joel F. Liebman, and Stephen E. Stein
DRB - Donald R. Burgess, Jr.
DH - Eugene S. Domalski and Elizabeth D. Hearing
Quantity | Value | Units | Method | Reference | Comment |
---|---|---|---|---|---|
Tboil | 613.15 | K | N/A | Senderens, 1925 | Uncertainty assigned by TRC = 5. K; TRC |
Quantity | Value | Units | Method | Reference | Comment |
Tfus | 322. ± 3. | K | AVG | N/A | Average of 16 values; Individual data points |
Quantity | Value | Units | Method | Reference | Comment |
Ttriple | 321. ± 3. | K | AVG | N/A | Average of 7 values; Individual data points |
Quantity | Value | Units | Method | Reference | Comment |
ΔvapH° | 107.7 ± 1.2 | kJ/mol | CGC | Nichols, Kweskin, et al., 2006 | AC |
ΔvapH° | 108.8 | kJ/mol | GS | Kulikov, Verevkin, et al., 2001 | Based on data from 328. to 362. K.; AC |
ΔvapH° | 112.5 | kJ/mol | CGC | Ova, Koultek, et al., 2000 | AC |
Quantity | Value | Units | Method | Reference | Comment |
ΔsubH° | 169.5 ± 2.5 | kJ/mol | C | Gundry, Harrop, et al., 1969 | ALS |
ΔsubH° | 169.6 | kJ/mol | N/A | Gundry, Harrop, et al., 1969 | DRB |
ΔsubH° | 167. ± 2. | kJ/mol | V | Davies and Kybett, 1965 | ALS |
ΔsubH° | 169.5 ± 2.1 | kJ/mol | N/A | Davies and Kybett, 1965 | AC |
Reduced pressure boiling point
Tboil (K) | Pressure (bar) | Reference | Comment |
---|---|---|---|
453.2 | 0.013 | Aldrich Chemical Company Inc., 1990 | BS |
Enthalpy of vaporization
ΔvapH (kJ/mol) | Temperature (K) | Method | Reference | Comment |
---|---|---|---|---|
100.4 | 347. | GS | Kulikov, Verevkin, et al., 2001 | Based on data from 328. to 362. K.; AC |
88.2 | 403. | N/A | N'Guimbi, Kasehgari, et al., 1992 | Based on data from 343. to 463. K.; AC |
68.9 | 524. | A | Stephenson and Malanowski, 1987 | Based on data from 509. to 569. K.; AC |
83.2 | 430. | A | Stephenson and Malanowski, 1987 | Based on data from 415. to 487. K. See also Ambrose, Ellender, et al., 1974.; AC |
109.4 | 329. | N/A | Stephenson and Malanowski, 1987 | Based on data from 323. to 335. K.; AC |
112.3 | 338. | N/A | Wilhoit and Zwolinski, 1973 | Based on data from 323. to 376. K.; AC |
78.8 | 423. | N/A | Wilhoit and Zwolinski, 1973 | Based on data from 418. to 463. K.; AC |
77.3 | 460. | DTA | Kemme and Kreps, 1969 | Based on data from 445. to 598. K.; AC |
109.5 | 329. | ME | Davies and Kybett, 1965 | Based on data from 323. to 335. K.; AC |
Antoine Equation Parameters
log10(P) = A − (B / (T + C))
P = vapor pressure (bar)
T = temperature (K)
View plot Requires a JavaScript / HTML 5 canvas capable browser.
Temperature (K) | A | B | C | Reference | Comment |
---|---|---|---|---|---|
415.44 to 487.32 | 4.05752 | 1803.451 | -152.831 | Ambrose, Ellender, et al., 1974 | Coefficents calculated by NIST from author's data. |
498.46 to 569.1 | 4.11528 | 1845.188 | -148.524 | Ambrose and Sprake, 1970 | Coefficents calculated by NIST from author's data. |
445.3 to 598.3 | 4.16673 | 1880.126 | -146.027 | Kemme and Kreps, 1969 |
Enthalpy of sublimation
ΔsubH (kJ/mol) | Temperature (K) | Method | Reference | Comment |
---|---|---|---|---|
167.4 ± 2.1 | 314. | ME | Davies and Kybett, 1965 | Based on data from 308. to 320. K. See also Stephenson and Malanowski, 1987.; AC |
Enthalpy of fusion
ΔfusH (kJ/mol) | Temperature (K) | Method | Reference | Comment |
---|---|---|---|---|
57.7 | 322.2 | AC | Xing, Tan, et al., 2008 | Based on data from 80. to 370. K.; AC |
33.1 | 321.6 | DSC | Ventol«65533», Calvet, et al., 2004 | AC |
33.97 | 322.9 | N/A | Kuchhal, Shukla, et al., 1979 | AC |
34.727 | 320. | N/A | Eykman, 1889 | DH |
Entropy of fusion
ΔfusS (J/mol*K) | Temperature (K) | Reference | Comment |
---|---|---|---|
108.5 | 320. | Eykman, 1889 | DH |
Enthalpy of phase transition
ΔHtrs (kJ/mol) | Temperature (K) | Initial Phase | Final Phase | Reference | Comment |
---|---|---|---|---|---|
12.500 | 308.9 | crystaline, III | crystaline, II | Petropavlov, Tsygankova, et al., 1988 | DH |
5.200 | 310.4 | crystaline, II | crystaline, I | Petropavlov, Tsygankova, et al., 1988 | DH |
33.600 | 322.3 | crystaline, α | liquid | Mosselman, Mourik, et al., 1974 | DH |
Entropy of phase transition
ΔStrs (J/mol*K) | Temperature (K) | Initial Phase | Final Phase | Reference | Comment |
---|---|---|---|---|---|
40.4 | 308.9 | crystaline, III | crystaline, II | Petropavlov, Tsygankova, et al., 1988 | DH |
16.8 | 310.4 | crystaline, II | crystaline, I | Petropavlov, Tsygankova, et al., 1988 | DH |
104.3 | 322.3 | crystaline, α | liquid | Mosselman, Mourik, et al., 1974 | DH |

Reaction thermochemistry data

Data compiled by: Hussein Y. Afeefy, Joel F. Liebman, and Stephen E. Stein
Individual Reactions
+
= C16H34O4S +
By formula: C16H34O + ClHO3S = C16H34O4S + HCl
Quantity | Value | Units | Method | Reference | Comment |
---|---|---|---|---|---|
ΔrH° | 14. ± 0.7 | kcal/mol | Cm | Markitanova, Barsukov, et al., 1981 | liquid phase; solvent: Dichloromethane; Sulfation |

Kovats' RI, non-polar column, isothermal

Column type | Active phase | Temperature (C) | I | Reference | Comment |
---|---|---|---|---|---|
Capillary | OV-101 | 200. | 1868.3 | Kittiratanapiboon, Jeyashoke, et al., 1998 | 15. m/0.25 mm/0.2 μm, N2 |
Packed | OV-101 | 220. | 1866.0 | Didaoui, Touabet, et al., 1997 | N2, Chromosorb G HP; Column length: 2. m |
Capillary | SE-30 | 200. | 1875.3 | Didaoui, Touabet, et al., 1997 | 27. m/0.4 mm/0.1 μm, N2, Chromosorb G HP |
Capillary | CP Sil 5 CB | 240. | 1877. | Hanai and Hong, 1989 | 30. m/0.25 mm/0.25 μm |
Capillary | DB-1 | 240. | 1874. | Hanai and Hong, 1989 | 30. m/0.25 mm/0.25 μm |
Capillary | SE-30 | 140. | 1852. | Haken and Korhonen, 1985 | Column length: 25. m; Column diameter: 0.33 mm |
Capillary | SE-30 | 160. | 1858. | Haken and Korhonen, 1985 | Column length: 25. m; Column diameter: 0.33 mm |
Capillary | SE-30 | 180. | 1862. | Haken and Korhonen, 1985 | Column length: 25. m; Column diameter: 0.33 mm |
Capillary | SE-30 | 200. | 1862. | Haken and Korhonen, 1985 | Column length: 25. m; Column diameter: 0.33 mm |
Capillary | SE-30 | 220. | 1861. | Haken and Korhonen, 1985 | Column length: 25. m; Column diameter: 0.33 mm |
Capillary | SE-30 | 240. | 1865. | Haken and Korhonen, 1985 | Column length: 25. m; Column diameter: 0.33 mm |
Capillary | SE-30 | 260. | 1866. | Haken and Korhonen, 1985 | Column length: 25. m; Column diameter: 0.33 mm |
Packed | Apiezon L | 210. | 1862. | Nedopekina, Kovalev, et al., 1981 | N2, Chromatron N-AW-HMDS; Column length: 2.5 m |
Packed | OV-101 | 150. | 1861. | Delley and Friedrich, 1977 | Gas Chrom Q (80-100 mesh) |
Packed | SE-30 | 180. | 1864. | Zarazir, Chovin, et al., 1970 | Chromosorb W; Column length: 2. m |

Kovats' RI, non-polar column, temperature ramp

Column type | Active phase | I | Reference | Comment |
---|---|---|---|---|
Capillary | HP-5MS | 1883. | Hazzit, Baaliouamer, et al., 2006 | 30. m/0.25 mm/0.25 μm, He, 60. C @ 8. min, 2. K/min, 280. C @ 30. min |
Capillary | BP-1 | 1856. | Raina, Verma, et al., 2006 | 25. m/0.32 mm/0.25 μm, N2, 5. K/min, 220. C @ 13. min; Tstart: 60. C |
Capillary | BP-1 | 1856. | Srivastava, Srivastava, et al., 2006 | 30. m/0.32 mm/0.25 μm, N2, 5. K/min, 220. C @ 3. min; Tstart: 60. C |
Capillary | SPB-1 | 1863. | Jayaprakasha, Rao, et al., 2002 | 30. m/0.32 mm/0.25 μm, He, 60. C @ 2. min, 2. K/min, 225. C @ 5. min |
Capillary | PTE-5 | 1882. | Gudzic, Dordevic, et al., 2001 | 60. m/0.32 mm/0.39 μm, H2, 4.3 K/min; Tstart: 60. C; Tend: 285. C |
Capillary | OV-101 | 1850. | Ohnishi and Shibamoto, 1984 | 2. K/min; Column length: 50. m; Column diameter: 0.23 mm; Tstart: 80. C; Tend: 200. C |
Capillary | OV-101 | 1852. | Ohnishi and Shibamoto, 1984 | 2. K/min; Column length: 50. m; Column diameter: 0.23 mm; Tstart: 80. C; Tend: 200. C |

Kovats' RI, non-polar column, custom temperature program

Column type | Active phase | I | Reference | Comment |
---|---|---|---|---|
Capillary | DB-5MS | 1880. | Maia, Andrade, et al., 2000 | 30. m/0.25 mm/0.25 μm, He; Program: 40C => 2C/min => 60C => 4C/min => 260C |

Kovats' RI, polar column, isothermal

Column type | Active phase | Temperature (C) | I | Reference | Comment |
---|---|---|---|---|---|
Capillary | CP-Wax | 240. | 2342. | Hanai and Hong, 1989 | 25. m/0.25 mm/0.22 μm |
Capillary | DB-Wax | 240. | 2379. | Hanai and Hong, 1989 | 25. m/0.25 mm/0.22 μm |
Capillary | OV-351 | 140. | 2365. | Haken and Korhonen, 1985 | N2; Column length: 25. m; Column diameter: 0.32 mm |
Capillary | OV-351 | 160. | 2362. | Haken and Korhonen, 1985 | N2; Column length: 25. m; Column diameter: 0.32 mm |
Capillary | OV-351 | 180. | 2367. | Haken and Korhonen, 1985 | N2; Column length: 25. m; Column diameter: 0.32 mm |
Capillary | OV-351 | 200. | 2370. | Haken and Korhonen, 1985 | N2; Column length: 25. m; Column diameter: 0.32 mm |
Capillary | OV-351 | 220. | 2375. | Haken and Korhonen, 1985 | N2; Column length: 25. m; Column diameter: 0.32 mm |

Van Den Dool and Kratz RI, non-polar column, temperature ramp

Column type | Active phase | I | Reference | Comment |
---|---|---|---|---|
Capillary | HP-5 | 1876. | Quijano, Salamanca, et al., 2007 | 30. m/0.25 mm/0.25 μm, He, 50. C @ 4. min, 4. K/min, 250. C @ 10. min |
Capillary | HP-5MS | 1882. | Saroglou, Marin, et al., 2007 | 30. m/0.25 mm/0.25 μm, He, 60. C @ 5. min, 4. K/min; Tend: 280. C |
Capillary | HP-5 | 1877. | Rezazadeh, Hamedani, et al., 2006 | 25. m/0.25 mm/0.25 μm, He, 4. K/min; Tstart: 60. C; Tend: 240. C |
Capillary | HP-5MS | 1871. | Saroglou, Dorizas, et al., 2006 | 30. m/0.25 mm/0.25 μm, He, 60. C @ 5. min, 4. K/min; Tend: 280. C |
Capillary | HP-5 | 1877. | Vundac, Pfeifhofer, et al., 2006 | 30. m/0.25 mm/0.25 μm, He, 40. C @ 5. min, 4. K/min; Tend: 300. C |
Capillary | HP-5 | 1882. | Zhao J.Y., Liu J.M., et al., 2006 | 30. m/0.25 mm/0.25 μm, He, 60. C @ 2. min, 10. K/min, 250. C @ 10. min |
Capillary | HP-5MS | 1879. | Pino, Mesa, et al., 2005 | 30. m/0.25 mm/0.25 μm, He, 60. C @ 2. min, 4. K/min, 250. C @ 20. min |
Capillary | DB-5 | 1879. | bin Ahmad and bin Jantan, 2003 | 25. m/0.25 mm/0.25 μm, N2, 75. C @ 10. min, 3. K/min, 210. C @ 1. min |
Capillary | HP-5 | 1882. | Skaltsa, Demetzos, et al., 2003 | 30. m/0.25 mm/0.25 μm, He, 60. C @ 5. min, 4. K/min; Tend: 280. C |
Capillary | HP-5MS | 1879. | Demetzos, Angelopoulou, et al., 2002 | 30. m/0.25 mm/0.25 μm, 50. C @ 5. min, 3. K/min; Tend: 280. C |
Capillary | DB-5 | 1881. | Nogueira, Bittrich, et al., 2001 | 30. m/0.25 mm/0.25 μm, H2, 3. K/min; Tstart: 60. C; Tend: 240. C |
Capillary | BPX-5 | 1900. | Oruna-Concha, Duckham, et al., 2001 | 50. m/0.32 mm/0.25 μm, He, 35. C @ 3. min, 4. K/min, 250. C @ 10. min |
Capillary | CP Sil 5 CB | 1864. | Pino and Marbot, 2001 | 50. m/0.32 mm/0.4 μm, He, 60. C @ 10. min, 3. K/min, 280. C @ 60. min |
Capillary | HP-5MS | 1882. | Skaltsa, Mavrommati, et al., 2001 | 30. m/0.25 mm/0.25 μm, He, 60. C @ 5. min, 4. K/min; Tend: 280. C |
Capillary | HP-5 | 1881. | Lazari, Skaltsa, et al., 2000 | 30. m/0.25 mm/0.25 μm, He, 50. C @ 5. min, 4. K/min; Tend: 280. C |
Capillary | DB-5 | 1882. | Marques, McElfresh, et al., 2000 | 30. m/0.25 mm/0.25 μm, 100. C @ 1. min, 5. K/min, 275. C @ 3. min |
Capillary | CP Sil 5 CB | 1864. | Pfeifhofer, 2000 | 50. m/0.22 mm/0.13 μm, H2, 4. K/min, 300. C @ 10. min; Tstart: 40. C |
Capillary | DB-1 | 1852. | Peng, 1992 | 15. m/0.53 mm/1. μm, 40. C @ 4. min, 8. K/min; Tend: 250. C |
Capillary | Ultra-1 | 1856. | Tokuda, Saitoh, et al., 1988 | 12.5 m/0.20 mm/0.11 μm, He, 5. K/min, 325. C @ 5. min; Tstart: 120. C |
Capillary | Ultra-1 | 1856. | Tokuda, Saitoh, et al., 1988 | 12.5 m/0.20 mm/0.11 μm, He, 5. K/min, 325. C @ 5. min; Tstart: 120. C |
Capillary | DB-5 | 1880. | Rostad and Pereira, 1986 | 30. m/0.26 mm/0.25 μm, He, 50. C @ 4. min, 6. K/min, 300. C @ 20. min |

Van Den Dool and Kratz RI, non-polar column, custom temperature program

Column type | Active phase | I | Reference | Comment |
---|---|---|---|---|
Capillary | HP-5MS | 1883.9 | Andriamaharavo, 2014 | 30. m/0.25 mm/0.25 μm, He; Program: 60C (1 min) => 5 C/min => 210C => 10 C/min => 280C (15 min) |
Capillary | SE-52 | 1876. | Bruni, Pellati, et al., 2005 | 30. m/0.32 mm/0.15 μm, He; Program: 45C => 1C/min => 100C => 5C/min => 250C(10min) |
Capillary | DB-5 | 1881. | Passos X.S., Castro A.C.M., et al., 2003 | 30. m/0.25 mm/0.25 μm, He; Program: 60C(2min) => 3C/min => 240C => 10C/min => 270C (4.5min) |
Capillary | DB-1 | 1866. | Peng, 2000 | 15. m/0.53 mm/1. μm, He; Program: 40C(3min) => 8C/min => 200(1min) => 5C/min => 300C(25min) |
Capillary | SE-52 | 1877. | Mondello, Dugo, et al., 1995 | 60. m/0.32 mm/0.40 μm, He; Program: 45 C (6 min) 3 C/min -> 111 0C 2 C/min -> 160 C 3 C/min -> 300 C (15 min) |
Capillary | Methyl Silicone | 1852. | Peng, Yang, et al., 1991 | Program: not specified |
Packed | SE-30 | 1852. | Peng, Ding, et al., 1988 | Supelcoport; Chromosorb; Column length: 3.05 m; Program: 40C(5min) => 10C/min => 200C or 250C (60min) |

Van Den Dool and Kratz RI, polar column, temperature ramp

Column type | Active phase | I | Reference | Comment |
---|---|---|---|---|
Capillary | DB-Wax | 2363. | Osorio, Alarcon, et al., 2006 | 30. m/0.25 mm/0.25 μm, He, 50. C @ 4. min, 4. K/min, 220. C @ 20. min |
Capillary | Stabilwax | 2387. | Cros, Lignot, et al., 2005 | 60. m/0.25 mm/0.25 μm, He, 40. C @ 5. min, 3. K/min, 240. C @ 10. min |
Capillary | Carbowax 20M | 2332. | Verzera, Campisi, et al., 2005 | 60. m/0.25 mm/0.25 μm, He, 45. C @ 0.17 min, 2. K/min; Tend: 250. C |
Capillary | ZB-Wax | 2382. | Ledauphin, Saint-Clair, et al., 2004 | 30. m/0.25 mm/0.15 μm, He, 35. C @ 5. min, 5. K/min, 220. C @ 10. min |
Capillary | Stabilwax | 2387. | Cros, Vandanjon, et al., 2003 | 60. m/0.25 mm/0.25 μm, He, 40. C @ 5. min, 3. K/min, 240. C @ 10. min |
Capillary | DB-Wax | 2385. | Marques, McElfresh, et al., 2000 | 30. m/0.32 mm/0.25 μm, 100. C @ 1. min, 5. K/min; Tend: 240. C |
Capillary | HP-Wax | 2391. | Peng, 2000 | 15. m/0.53 mm/1. μm, He, 40. C @ 3. min, 5. K/min, 220. C @ 30. min |
Capillary | Carbowax 20M | 2361. | Mondello, Dugo, et al., 1995 | 60. m/0.32 mm/0.425 μm, He, 45. C @ 3. min, 3. K/min, 300. C @ 20. min |
Capillary | DB-Wax | 2400. | Shiratsuchi, Shimoda, et al., 1994 | 60. m/0.25 mm/0.25 μm, 2. K/min, 230. C @ 60. min; Tstart: 50. C |
Capillary | DB-Wax | 2400. | Shiratsuchi, Shimoda, et al., 1994, 2 | 60. m/0.25 mm/0.25 μm, He, 2. K/min, 230. C @ 60. min; Tstart: 50. C |
Capillary | Supelcowax-10 | 2381. | Chung and Cadwallader, 1993 | 60. m/0.25 mm/0.25 μm, He, 40. C @ 5. min, 2. K/min, 195. C @ 40. min |
Capillary | Carbowax 20M | 2352. | Peng, 1992 | 8. K/min, 200. C @ 60. min; Column length: 3.05 m; Tstart: 40. C |
Packed | Carbowax 20M | 2352. | Peng, Yang, et al., 1991 | Supelcoport, 40. C @ 4. min, 8. K/min; Column length: 3.05 m; Tend: 200. C |
Capillary | DB-Wax | 2333. | Frohlich and Schreier, 1990 | 30. m/0.32 mm/0.25 μm, He, 40. C @ 3. min, 5. K/min; Tend: 220. C |
Capillary | Carbowax 20M | 2365. | Schwab, Mahr, et al., 1989 | 30. m/0.25 mm/0.25 μm, He, 40. C @ 3. min, 4. K/min; Tend: 240. C |

Van Den Dool and Kratz RI, polar column, custom temperature program

Column type | Active phase | I | Reference | Comment |
---|---|---|---|---|
Capillary | DB-Wax | 2400. | Ferrari, Lablanquie, et al., 2004 | 60. m/0.25 mm/0.25 μm, He; Program: 35C(0.7min) => 20C/min => 70C => 4C/min => 240C |

Normal alkane RI, non-polar column, temperature ramp

Column type | Active phase | I | Reference | Comment |
---|---|---|---|---|
Capillary | HP-5 MS | 1882. | Jerkovic, Hegic, et al., 2010 | 30. m/0.25 mm/0.25 μm, Helium, 70. C @ 2. min, 3. K/min, 200. C @ 18. min |
Capillary | HP-5 MS | 1882. | Jerkovic and Marijanovic, 2010 | 30. m/0.25 mm/0.25 μm, Helium, 70. C @ 2. min, 3. K/min, 200. C @ 18. min |
Capillary | HP-5 | 1880. | Kahriman, Tosun, et al., 2010 | 30. m/0.32 mm/0.25 μm, Helium, 60. C @ 2. min, 3. K/min; Tend: 240. C |
Capillary | HP-5 | 1882. | Monsef-Esfahani, Miri, et al., 2010 | 30. m/0.25 mm/0.25 μm, Helium, 50. C @ 5. min, 3. K/min; Tend: 240. C |
Capillary | HP-5 MS | 1883. | Radulovic, Blagojevic, et al., 2010 | 30. m/0.25 mm/0.25 μm, Helium, 5. K/min, 290. C @ 10. min; Tstart: 70. C |
Capillary | DB-1 | 1864. | Xu, Tang, et al., 2010 | 30. m/0.25 mm/0.25 μm, Helium, 50. C @ 2. min, 4. K/min, 220. C @ 2. min |
Capillary | HP-5 | 1879. | Lago, Favero, et al., 2009 | 30. m/0.32 mm/0.25 μm, Helium, 50. C @ 2. min, 5. K/min, 280. C @ 5. min |
Capillary | HP-1 | 1865. | Wetwiayaklung, Thavanapong, et al., 2009 | 25. m/0.32 mm/0.17 μm, 50. C @ 5. min, 1. K/min, 260. C @ 5. min |
Capillary | HP-5 | 1870. | Bousaada, Ammar, et al., 2008 | 30. m/0.25 mm/0.25 μm, Nitrogen, 50. C @ 1. min, 5. K/min, 280. C @ 1. min |
Capillary | HP-5 MS | 1879. | Forero, Quijano, et al., 2008 | 30. m/0.25 mm/0.25 μm, Helium, 50. C @ 4. min, 4. K/min, 230. C @ 10. min |
Capillary | HP-5 | 1886. | Saidana, Mahjoub, et al., 2008 | 30. m/0.25 mm/0.25 μm, Nitrogen, 50. C @ 1. min, 5. K/min, 280. C @ 1. min |
Capillary | DB-5 | 1882. | Amiri, 2007 | 50. m/0.20 mm/0.32 μm, Nitrogen, 60. C @ 3. min, 5. K/min, 220. C @ 5. min |
Capillary | HP-5MS | 1874. | Ferhat, Tigrine-Kordjani, et al., 2007 | 30. m/0.25 mm/0.25 μm, He, 60. C @ 8. min, 2. K/min, 250. C @ 15. min |
Capillary | DB-5 | 1873. | Smelcerovic, Spiteller, et al., 2007 | 30. m/0.25 mm/0.25 μm, He, 10. K/min, 320. C @ 4. min; Tstart: 60. C |
Capillary | Elite-5MS | 1880. | Tava, Pecetti, et al., 2007 | 30. m/0.32 mm/0.5 μm, He, 40. C @ 5. min, 4. K/min, 280. C @ 10. min |
Capillary | HP-101 | 1858. | Mastelic, Jerkovic, et al., 2006 | 25. m/0.2 mm/0.2 μm, He, 70. C @ 2. min, 3. K/min, 200. C @ 15. min |
Capillary | DB-1 | 1866. | Pala-Paul J., Perez-Alonso M.J., et al., 2006 | 50. m/0.25 mm/0.25 μm, N2, 4. K/min; Tstart: 95. C; Tend: 240. C |
Capillary | HP-5MS | 1875. | Setzer, Noletto, et al., 2006 | 30. m/0.25 mm/0.25 μm, He, 60. C @ 5. min, 3. K/min; Tend: 280. C |
Capillary | HP-5 MS | 1874. | Tigrine-Kordiani, Meklati, et al., 2006 | 30. m/0.25 mm/0.25 μm, Helium, 60. C @ 8. min, 2. K/min, 250. C @ 15. min |
Capillary | HP-1 | 1864. | Valette, Fernandez, et al., 2006 | 50. m/0.2 mm/0.5 μm, He, 2. K/min, 250. C @ 40. min; Tstart: 60. C |
Capillary | DB-5 | 1875. | Askari and Sefidkon, 2005 | 30. m/0.25 mm/0.25 μm, He, 60. C @ 5. min, 3. K/min; Tend: 210. C |
Capillary | BPX5 | 1892. | Dickschat, Bode, et al., 2005 | 25. m/0.22 mm/0.25 μm, Helium, 50. C @ 5. min, 5. K/min; Tend: 320. C |
Capillary | DB-1 | 1841. | Fakhari A.R., Sonboli A., et al., 2005 | 60. m/0.25 mm/0.25 μm, N2, 5. K/min, 250. C @ 10. min; Tstart: 60. C |
Capillary | DB-1 | 1860. | Khanavi, Ghasemian, et al., 2005 | 30. m/0.25 mm/0.25 μm, He, 50. C @ 1. min, 2.5 K/min, 265. C @ 20. min |
Capillary | HP-5 | 1883.5 | Leffingwell and Alford, 2005 | 60. m/0.32 mm/0.25 μm, He, 30. C @ 2. min, 2. K/min, 260. C @ 28. min |
Capillary | DB-5 | 1878. | Morteza-Semnani and Saeedi, 2005 | 30. m/0.25 mm/0.25 μm, He, 60. C @ 4. min, 4. K/min; Tend: 220. C |
Capillary | HP-5 | 1879. | Saeidnia, Gohari, et al., 2005 | He, 5. K/min; Column length: 30. m; Column diameter: 0.25 mm; Tstart: 60. C; Tend: 240. C |
Capillary | SPB-5 | 1886. | Ledauphin, Guichard, et al., 2003 | 30. m/0.32 mm/0.25 μm, He, 40. C @ 1. min, 5. K/min, 220. C @ 20. min |
Capillary | DB-1 | 1875. | Mahalwal and Ali, 2003 | 30. m/0.25 mm/0.25 μm, N2, 4. K/min; Tstart: 80. C; Tend: 250. C |
Capillary | HP-5 | 1881. | Naka, van Vang, et al., 2003 | He, 100. C @ 2. min, 8. K/min, 240. C @ 15. min; Column length: 30. m; Column diameter: 0.25 mm |
Capillary | HP-5 | 1876. | Velickovic, Randjelovic, et al., 2003 | 25. m/0.32 mm/0.53 μm, H2, 4. K/min; Tstart: 40. C; Tend: 280. C |
Capillary | HP-5 | 1879. | Velickovic, Randjelovic, et al., 2003 | 25. m/0.32 mm/0.53 μm, H2, 4. K/min; Tstart: 40. C; Tend: 280. C |
Capillary | RSL-200 | 1870. | Jirovetz, Buchbauer, et al., 2002 | 30. m/0.32 mm/0.25 μm, H2, 40. C @ 5. min, 6. K/min, 280. C @ 5. min |
Capillary | RSL-200 | 1870. | Jirovetz, Smith, et al., 2002 | 30. m/0.25 mm/0.25 μm, H2, 40. C @ 2. min, 6. K/min, 280. C @ 10. min |
Capillary | DB-5 | 1876. | Morteza-Semnani, Saeedi, et al., 2002 | 30. m/0.25 mm/0.25 μm, He, 60. C @ 5. min, 4. K/min; Tend: 220. C |
Capillary | HP-5 | 1879. | Velickovic, Randjelovic, et al., 2002 | 30. m/0.25 mm/0.25 μm, H2, 4. K/min; Tstart: 40. C; Tend: 280. C |
Capillary | HP-5 | 1880. | Bicalho, Pereira, et al., 2000 | 30. m/0.25 mm/0.25 μm, H2, 40. C @ 10. min, 3. K/min, 280. C @ 10. min |
Capillary | SPB-5 | 1839. | Kim, Kim, et al., 2000 | 60. m/0.25 mm/0.25 μm, He, 70. C @ 8. min, 5. K/min, 240. C @ 20. min |
Capillary | OV-101 | 1863. | Tamura, Boonbumrung, et al., 2000 | Nitrogen, 40. C @ 10. min, 2. K/min; Column length: 50. m; Column diameter: 0.25 mm; Tend: 200. C |
Capillary | DB-5 | 1841. | Reverchon, Porta, et al., 1997 | 30. m/0.25 mm/0.25 μm, He, 50. C @ 5. min, 2. K/min; Tend: 250. C |
Capillary | Ultra-1 | 1863. | Okumura, 1991 | 25. m/0.32 mm/0.25 μm, He, 3. K/min; Tstart: 80. C; Tend: 260. C |
Capillary | DB-1 | 1869. | Shiota, 1991 | 60. m/0.25 mm/0.25 μm, He, 3. K/min; Tstart: 50. C; Tend: 240. C |
Capillary | DB-1 | 1872. | Shiota, 1991 | 60. m/0.25 mm/0.25 μm, He, 3. K/min; Tstart: 50. C; Tend: 240. C |
Capillary | SE-54 | 1890. | Bestmann, Classen, et al., 1988 | N2, 60. C @ 2. min, 6. K/min; Column length: 25. m; Column diameter: 0.25 mm; Tend: 260. C |

Normal alkane RI, non-polar column, custom temperature program

Column type | Active phase | I | Reference | Comment |
---|---|---|---|---|
Capillary | SLB-5 MS | 1884. | Mondello, 2012 | 30. m/0.25 mm/0.25 μm, Helium; Program: not specified |
Capillary | SLB-5 MS | 1885. | Mondello, 2012 | 30. m/0.25 mm/0.25 μm, Helium; Program: not specified |
Capillary | Siloxane, 5 % Ph | 1894. | VOC BinBase, 2012 | Program: not specified |
Capillary | HP-5 MS | 1878. | Payo, Colo, et al., 2011 | Program: not specified |
Capillary | HP-5 MS | 1895. | Payo, Colo, et al., 2011 | Program: not specified |
Capillary | Polydimethyl siloxane, 5 % phenyl | 1894. | Skogerson, Wohlgemuth, et al., 2011 | Program: not specified |
Capillary | HP-5 | 1876. | Kahriman, Tosun, et al., 2010 | 30. m/0.32 mm/0.25 μm, Helium; Program: not specified |
Capillary | DB-1 | 1871. | Xu, Tang, et al., 2010 | 30. m/0.25 mm/0.25 μm, Helium; Program: not specified |
Capillary | ZB-1 MS | 1854. | Al-Reza, Rahman, et al., 2009 | 30. m/0.25 mm/0.25 μm, Helium; Program: 50 0C 3 0C/min -> 150 0C (10 min) 10 0C/min -> 250 0C |
Capillary | BPX-5 | 1888. | se Souza, Cardeal, et al., 2009 | 30. m/0.25 mm/0.25 μm, Helium; Program: 35 0C (5 min) 3 0C/min -> 210 0C 40 0C/min -> 240 0C (10 min) |
Capillary | BPX-5 | 1875. | se Souza, Cardeal, et al., 2009 | 30. m/0.25 mm/0.25 μm, Helium; Program: not specified |
Capillary | HP-1 | 1865. | Wetwiayaklung, Thavanapong, et al., 2009 | 25. m/0.32 mm/0.17 μm; Program: not specified |
Capillary | HP-5MS | 1870. | Liu, Song, et al., 2007 | 30. m/0.25 mm/0.25 μm, He; Program: 40C(3min) => 8C/min => 160C => 15C/min => 300C (10min) |
Capillary | HP-5MS | 1881. | Moronkola, Ogunwande, et al., 2007 | 30. m/0.25 mm/0.25 μm, He; Program: 40C(10min) => 3C/min => 200C => 2C/min => 220C |
Capillary | DB-5 | 1876. | Nivinsliene, Butkiene, et al., 2007 | 50. m/0.32 mm/0.25 μm, Helium; Program: 60 0C (1 min) 5 0C/min -> 160 0C 10 0C/min -> 250 0C |
Capillary | CP Sil 8 CB | 1876. | Radusiene, Judzentiene, et al., 2007 | 50. m/0.32 mm/0.25 μm, Helium; Program: 60 0C (2 min) 5 0C/min -> 160 0C (1 min) 10 0C/min -> 280 0C (3 min) |
Capillary | HP-5 | 1881. | Demyttenaere, Sánchez Martínez, et al., 2003 | 30. m/0.25 mm/0.25 μm, He; Program: 35C => 5C/min => 220C => 10C/min => 240C(5min) |
Capillary | BPX-5 | 1894. | Machiels, van Ruth, et al., 2003 | 60. m/0.32 mm/1. μm, He; Program: 40C (4min) => 2C/min => 90C => 4C/min => 130C => 8C/min => 250 C (10min) |
Capillary | HP-5MS | 1881. | Demyttenaere, Sánchez Martínez, et al., 2002 | 30. m/0.25 mm/0.25 μm, He; Program: 35C => 5C/min => 160C => 10C/min => 220C (10min) |
Capillary | DB-5 | 1876. | Morteza-Semnani and Vahedi, 2002 | Program: not specified |
Capillary | DB-5 | 1878. | Andrade, Maia, et al., 2000 | 30. m/0.25 mm/0.25 μm, He; Program: 40C => 2C/min => 60C => 4C/min => 260C |

Normal alkane RI, polar column, temperature ramp

Column type | Active phase | I | Reference | Comment |
---|---|---|---|---|
Capillary | AT-Wax | 2355. | Kiss, Csoka, et al., 2011 | 60. m/0.25 mm/0.25 μm, Helium, 4. K/min; Tstart: 60. C; Tend: 280. C |
Capillary | HP-Innowax | 2364. | Bousaada, Ammar, et al., 2008 | 30. m/0.25 mm/0.25 μm, Nitrogen, 50. C @ 1. min, 5. K/min, 280. C @ 1. min |
Capillary | Stabilwax | 2387. | Cros, Vandanjon, et al., 2007 | 60. m/0.25 mm/0.25 μm, Helium, 40. C @ 5. min, 3. K/min, 240. C @ 10. min |
Capillary | HP-20M | 2386. | Mastelic, Jerkovic, et al., 2006 | 50. m/0.2 mm/0.2 μm, He, 70. C @ 4. min, 4. K/min, 180. C @ 15. min |
Capillary | Stabilwax | 2387. | Cros, Vandanjon, et al., 2003, 2 | 60. m/0.25 mm/0.25 μm, Helium, 40. C @ 5. min, 3. K/min, 240. C @ 10. min |
Capillary | DB-Wax | 2383. | Dregus and Engel, 2003 | 60. m/0.32 mm/0.25 μm, H2, 40. C @ 5. min, 4. K/min, 230. C @ 25. min |
Capillary | TC-WAX FFS | 2378. | Miyazawa, Maehara, et al., 2002 | He, 3. K/min; Column length: 60. m; Column diameter: 0.25 mm; Tstart: 60. C; Tend: 240. C |
Capillary | DB-Wax | 2393. | Tamura, Boonbumrung, et al., 2000 | Nitrogen, 40. C @ 10. min, 2. K/min; Column length: 60. m; Column diameter: 0.25 mm; Tend: 200. C |
Capillary | DB-Wax | 2377. | Umano, Hagi, et al., 2000 | 60. m/0.25 mm/0.25 μm, He, 40. C @ 2. min, 2. K/min; Tend: 200. C |
Capillary | Innowax | 2376. | Kaya, Baser, et al., 1999 | 60. m/0.25 mm/0.25 μm, He, 60. C @ 10. min; Tend: 220. C |
Capillary | HP-Innowax FSC | 2380. | Tümen, Baser, et al., 1998 | 60. m/0.25 mm/0.25 μm, He, 60. C @ 10. min, 4. K/min, 220. C @ 10. min |
Capillary | HP-Innowax FSC | 2380. | Baser, Kirimer, et al., 1997 | He, 60. C @ 10. min, 4. K/min, 240. C @ 10. min; Column length: 60. m; Column diameter: 0.25 mm |

Normal alkane RI, polar column, custom temperature program

Column type | Active phase | I | Reference | Comment |
---|---|---|---|---|
Capillary | Innowax FSC | 2384. | Akin, Saracoglu, et al., 2012 | 60. m/0.25 mm/0.25 μm, Helium; Program: 60 0C (10 min) 4 0C/min -> 220 0C (10 min) 1 oC/min -> 240 0C |
Capillary | HP Innowax FSP | 2384. | Wedge, Klun, et al., 2009 | 60. m/0.25 mm/0.25 μm, Helium; Program: 60 0C (10 min) 4 0C/min -> 220 0C (10 min) 1 0C/min -> 240 0C (20 min) |
Capillary | HP-Innowax FSC | 2384. | Baser K.H.C. and Demirci B., 2007 | 60. m/0.25 mm/0.25 μm, N2; Program: 60C(10min) => 4C/min => 220C(10min) => 1C/min => 240C |
Capillary | Carbowax 20M | 2332. | Editorial paper, 2005 | Program: not specified |
Capillary | HP-Innowax FSC | 2384. | Demirci, Baser, et al., 2003 | 60. m/0.25 mm/0.25 μm, He; Program: 60C (10min) => 4C/min => 220C (10min) => 1C/min => 240C |
Capillary | HP-Innowax FSC | 2384. | Demirci, Dadandi, et al., 2003 | 60. m/0.25 mm/0.25 μm, He; Program: 60C(10min) => 4C/min => 220C(10min) => 1C/min => 240C |
Capillary | HP-Innowax FSC | 2384. | Erdemoglu, Sener, et al., 2003 | 60. m/0.25 mm/0.25 μm, He; Program: 60C(10min) => 4C/min => 220C(10min) => 1C/min => 240C |
Capillary | HP-Innowax FSC | 2384. | Kürkcüoglu, Demirci, et al., 2003 | 60. m/0.25 mm/0.25 μm, He; Program: 60C(10min) => 4C/min => 220C(10min) => 1C/min => 240C(40min) |
Capillary | HP-Innowax | 2384. | Baser, Demirci, et al., 2001 | 60. m/0.25 mm/0.25 μm, He; Program: 60 0C (10 min) 10 K/min -> 220 0C (10 min) 1K/min -> 240 0C |
Capillary | HP-Innowax | 2384. | Gören, Demirci, et al., 2001 | 60. m/0.25 mm/0.25 μm, He; Program: 60 0C (10 min) 4 K/min -> 220 0C (10 min) 1 K/min -> 240 0C |
Capillary | HP-Innowax FSC | 2384. | Kaya, Demirci, et al., 2001 | 60. m/0.25 mm/0.25 μm; Program: 60C(10min) => 4C/min => 220C(10min) => 1C/min => 240C |
Capillary | Innowax FSC | 2384. | Kirimer, Tabanca, et al., 2000 | 60. m/0.25 mm/0.25 μm, He; Program: 60C(10 min) => 4C/min => 220C(10min) => 1C/min => 240C |
Capillary | NB-351 | 2387. | Kerrola and Kallio, 1994 | 25. m/0.32 mm/0.2 μm, He; Program: 35C(5min) => 2.5C/min => 150C => 5C/min => 240C (20min) |
Capillary | DB-Wax | 2352. | Peng, Yang, et al., 1991, 2 | Program: not specified |

Lee's RI, non-polar column, temperature ramp

Column type | Active phase | I | Reference | Comment |
---|---|---|---|---|
Capillary | DB-5MS | 312.09 | Chen, Keeran, et al., 2002 | 30. m/0.25 mm/0.5 μm, 40. C @ 1. min, 10. K/min; Tend: 310. C |
Capillary | DB-5MS | 315.14 | Chen, Keeran, et al., 2002 | 30. m/0.25 mm/0.5 μm, 40. C @ 1. min, 4. K/min; Tend: 310. C |
Capillary | DB-5 | 314.03 | Rostad and Pereira, 1986 | 30. m/0.26 mm/0.25 μm, He, 50. C @ 4. min, 6. K/min, 300. C @ 20. min |

References

Mosselman and Dekker, 1975
Mosselman, C.; Dekker, H.,
Enthalpies of formation of n-alkan-1-ols,
J. Chem. Soc. Faraday Trans. 1, 1975, 417-424. [all data]
Gundry, Harrop, et al., 1969
Gundry, H.A.; Harrop, D.; Head, A.J.; Lewis, G.B.,
Thermodynamic properties of organic oxygen compounds. 21. Enthalpies of combustion of benzoic acid, pentan-1-ol, octan-1-ol, and hexadecan-1-ol,
J. Chem. Thermodyn., 1969, 1, 321-332. [all data]
Parks, Mosley, et al., 1950
Parks, G.S.; Mosley, J.R.; Peterson, P.V., Jr.,
Heats of combustion and formation of some organic compounds containing oxygen,
J. Chem. Phys., 1950, 18, 152. [all data]
Wilhoit R.C., 1973
Wilhoit R.C.,
Physical and thermodynamic properties of aliphatic alcohols,
J. Phys. Chem. Ref. Data, 1973, 2, Suppl. 1, 1-420. [all data]
Green J.H.S., 1961
Green J.H.S.,
Thermodynamic properties of the normal alcohols C1-C12,
J. Appl. Chem., 1961, 11, 397-404. [all data]
Thermodynamics Research Center, 1997
Thermodynamics Research Center,
Selected Values of Properties of Chemical Compounds., Thermodynamics Research Center, Texas A&M University, College Station, Texas, 1997. [all data]
Cox and Pilcher, 1970
Cox, J.D.; Pilcher, G.,
Thermochemistry of Organic and Organometallic Compounds, Academic Press, New York, 1970, 1-636. [all data]
Richardson and Parks, 1939
Richardson, J.W.; Parks, G.S.,
Thermal data on organic compounds. XIX. Modern combustion data for some non-volatile compounds containing carbon, hydrogen and oxygen,
J. Am. Chem. Soc., 1939, 61, 3543-3546. [all data]
Freeman and Bagby, 1989
Freeman, B.; Bagby, M.O.,
Heats of combustion of fatty esters and triglycerides,
J. Am. Oil Chem. Soc., 1989, 66, 1601-1605. [all data]
Parks, Kennedy, et al., 1956
Parks, G.S.; Kennedy, W.D.; Gates, R.R.; Mosley, J.R.; Moore, G.E.; Renquist, M.L.,
Thermal data on organic compounds. XXVI. Some heat capacity, entropy and free energy data for seven compounds containing oxygen.,
Not In System, 1956, 78, 56-59. [all data]
Khasanshin and Zykova, 1989
Khasanshin, T.S.; Zykova, T.B.,
Specific heat of saturated monatomic alcohols,
Inzh. -Fiz. Zhur., 1989, 56(6), 991-994. [all data]
Mosselman, Mourik, et al., 1974
Mosselman, C.; Mourik, J.; Dekker, H.,
Enthalpies of phase change and heat capacities of some long-chain alcohols. Adiabatic semi-microcalorimeter for studies of polymorphism,
J. Chem. Thermodynam., 1974, 6, 477-487. [all data]
Senderens, 1925
Senderens, J.B.,
C. R. Hebd. Seances Acad. Sci., 1925, 181, 698. [all data]
Nichols, Kweskin, et al., 2006
Nichols, Gary; Kweskin, Sasha; Frericks, Margaret; Reiter, Sarah; Wang, Gin; Orf, Jennifer; Carvallo, Brett; Hillesheim, Dorothea; Chickos, James,
Evaluation of the Vaporization, Fusion, and Sublimation Enthalpies of the 1-Alkanols: The Vaporization Enthalpy of 1-, 6-, 7-, and 9-Heptadecanol, 1-Octadecanol, 1-Eicosanol, 1-Docosanol, 1-Hexacosanol, and Cholesterol at T = 298.15 K by Correlation Gas Chromatography,
J. Chem. Eng. Data, 2006, 51, 2, 475-482, https://doi.org/10.1021/je0503857
. [all data]
Kulikov, Verevkin, et al., 2001
Kulikov, Dmitry; Verevkin, Sergey P.; Heintz, Andreas,
Enthalpies of vaporization of a series of aliphatic alcohols,
Fluid Phase Equilibria, 2001, 192, 1-2, 187-207, https://doi.org/10.1016/S0378-3812(01)00633-1
. [all data]
Ova, Koultek, et al., 2000
Ova, P.V.; Koultek, B.; Hoskovec, M.,
Practice Oriented Results on Use and Production of Neem Ingredients and Pheromones VI, H. Kleeberg and C.P.W. Zebitz, ed(s)., Druck and Graphic, Giessen, 2000, 211-218. [all data]
Davies and Kybett, 1965
Davies, M.; Kybett, B.,
Sublimation and vaporization heats of long-chain alcohols,
Trans. Faraday Soc., 1965, 61, 1608. [all data]
Aldrich Chemical Company Inc., 1990
Aldrich Chemical Company Inc.,
Catalog Handbook of Fine Chemicals, Aldrich Chemical Company, Inc., Milwaukee WI, 1990, 1. [all data]
N'Guimbi, Kasehgari, et al., 1992
N'Guimbi, J.; Kasehgari, H.; Mokbel, I.; Jose, J.,
Tensions de vapeur d'alcools primaires dans le domaine 0,3 Pa à 1,5 kPa,
Thermochimica Acta, 1992, 196, 2, 367-377, https://doi.org/10.1016/0040-6031(92)80100-B
. [all data]
Stephenson and Malanowski, 1987
Stephenson, Richard M.; Malanowski, Stanislaw,
Handbook of the Thermodynamics of Organic Compounds, 1987, https://doi.org/10.1007/978-94-009-3173-2
. [all data]
Ambrose, Ellender, et al., 1974
Ambrose, D.; Ellender, J.H.; Sprake, C.H.S.,
Thermodynamic properties of organic oxygen compounds XXXV. Vapour pressures of aliphatic alcohols,
The Journal of Chemical Thermodynamics, 1974, 6, 9, 909-914, https://doi.org/10.1016/0021-9614(74)90235-3
. [all data]
Wilhoit and Zwolinski, 1973
Wilhoit, R.C.; Zwolinski, B.J.,
Physical and thermodynamic properties of aliphatic alcohols,
J. Phys. Chem. Ref. Data Suppl., 1973, 1, 2, 1. [all data]
Kemme and Kreps, 1969
Kemme, Herbert R.; Kreps, Saul I.,
Vapor pressure of primary n-alkyl chlorides and alcohols,
J. Chem. Eng. Data, 1969, 14, 1, 98-102, https://doi.org/10.1021/je60040a011
. [all data]
Ambrose and Sprake, 1970
Ambrose, D.; Sprake, C.H.S.,
Thermodynamic properties of organic oxygen compounds XXV. Vapour pressures and normal boiling temperatures of aliphatic alcohols,
The Journal of Chemical Thermodynamics, 1970, 2, 5, 631-645, https://doi.org/10.1016/0021-9614(70)90038-8
. [all data]
Xing, Tan, et al., 2008
Xing, J.; Tan, Z.-C.; Shi, Q.; Tong, B.; Wang, S.-X.; Li, Y.-S.,
Heat capacity and thermodynamic properties of 1-hexadecanol,
J Therm Anal Calorim, 2008, 92, 2, 375-380, https://doi.org/10.1007/s10973-007-8955-1
. [all data]
Ventol«65533», Calvet, et al., 2004
Ventol«65533», L.; Calvet, T.; Cuevas-Diarte, M.A.; Ram«65533»rez, M.; Oonk, H.A.J.; Mondieig, D.; Negrier, Ph.,
Melting behaviour in the n-alkanol family. Enthalpy?entropy compensation,
Phys. Chem. Chem. Phys., 2004, 6, 8, 1786, https://doi.org/10.1039/b313106h
. [all data]
Kuchhal, Shukla, et al., 1979
Kuchhal, Y.K.; Shukla, R.N.; Biswas, A.B.,
Differential thermal analysis of n-long chain alcohols and corresponding alkoxy ethanols,
Thermochimica Acta, 1979, 31, 1, 61-70, https://doi.org/10.1016/0040-6031(79)80008-8
. [all data]
Eykman, 1889
Eykman, J.F.,
Zur kryoskopischen Molekulargewichtsbestimmung,
Z. Physik. Chem., 1889, 4, 497-519. [all data]
Petropavlov, Tsygankova, et al., 1988
Petropavlov, N.N.; Tsygankova, I.G.; Teslenko, L.A.,
Microcalorimetric investigation of polymorphic transitions in organic crystals,
Sov. Phys. Crystallogr., 1988, 33(6), 853-855. [all data]