trans-1-Acetyl-2-methylcyclopentane
- Formula: C8H14O
- Molecular weight: 126.1962
- IUPAC Standard InChIKey: SIXBTZFYFSHXJI-XPUUQOCRSA-N
- CAS Registry Number: 3664-70-8
- Chemical structure:

Phase change data

Data compiled as indicated in comments:
TRC - Thermodynamics Research Center, NIST Boulder Laboratories, Chris Muzny director
BS - Robert L. Brown and Stephen E. Stein
Quantity | Value | Units | Method | Reference | Comment |
---|---|---|---|---|---|
Tboil | 440.25 | K | N/A | Pines and Hoffman, 1954 | Uncertainty assigned by TRC = 1. K; TRC |
Reduced pressure boiling point
Tboil (K) | Pressure (atm) | Reference | Comment |
---|---|---|---|
443. to 444. | 0.026 | Buckingham and Donaghy, 1982 | BS |

References

Pines and Hoffman, 1954
Pines, H.; Hoffman, N.E.,
Studies in the Terpene Series XXI. The Thelrmal Isomerization of 6,6-Dimethylnorpinane at Atmosphereic Pressure,
J. Am. Chem. Soc., 1954, 76, 4417. [all data]
Buckingham and Donaghy, 1982
Buckingham, J.; Donaghy, S.M.,
Dictionary of Organic Compounds: Fifth Edition, Chapman and Hall, New York, 1982, 1. [all data]