2,2'-Bipyridine

Gas phase thermochemistry data

Data compiled by: Hussein Y. Afeefy, Joel F. Liebman, and Stephen E. Stein

Quantity Value Units Method Reference Comment
Δfgas267.9 ± 3.0kJ/molCcbRibeiro da Silva, Morais, et al., 1995
Δfgas289.0 ± 5.2kJ/molCcbFaour and Akasheh, 1985

Normal alkane RI, non-polar column, temperature ramp

Data compiled by: NIST Mass Spectrometry Data Center, William E. Wallace, director

Column type Capillary
Active phase DB-1
Column length (m) 60.
Carrier gas He
Substrate
Column diameter (mm) 0.32
Phase thickness (μm) 1.0
Tstart (C) 40.
Tend (C) 260.
Heat rate (K/min) 3.
Initial hold (min)
Final hold (min)
I 1444.
ReferenceChen and Ho, 1998
Comment MSDC-RI

References

Ribeiro da Silva, Morais, et al., 1995
Ribeiro da Silva, M.A.V.; Morais, V.M.F.; Matos, M.A.R.; Rio, C.M.A., Thermochemical and theoretical studies of some bipyridines, J. Org. Chem., 1995, 60, 5291-5294. [all data]

Faour and Akasheh, 1985
Faour, M.; Akasheh, T.S., Heat of combustion of some N-heterocycle compounds. Part 1, J. Chem. Soc. Perkin Trans. 2, 1985, 811-713. [all data]