Isothioate
- Formula: C7H17O2PS3
- Molecular weight: 260.377
- IUPAC Standard InChIKey: SPCNPOWOBZQWJK-UHFFFAOYSA-N
- CAS Registry Number: 36614-38-7
- Chemical structure:
View 3d structure (requires JavaScript / HTML 5) - Permanent link for this species. Use this link for bookmarking this species for future reference.

Normal alkane RI, non-polar column, isothermal

Column type | Active phase | Temperature (C) | I | Reference | Comment |
---|---|---|---|---|---|
Packed | OV-1 | 190. | 1720. | TSunoda, 1986 | Helium, Chromosorb W AW DMCS; Column length: 1. m |

Normal alkane RI, non-polar column, temperature ramp

Column type | Active phase | I | Reference | Comment |
---|---|---|---|---|
Packed | OV-1 | 1720. | TSunoda, 1986 | Helium, Chromosorb W AW DMCS, 4. K/min, 210. C @ 20. min; Column length: 1. m; Tstart: 140. C |

References

TSunoda, 1986
TSunoda, N.,
Simultaneous determination of organophosphorous pesticides in forencis chemistry by gas-liquid chromatography with hydrogen flame ionization detector,
Eisei Kagaku, 1986, 32, 2, 91-100, https://doi.org/10.1248/jhs1956.32.91
. [all data]