nonyloxybenzene
- Formula: C15H24O
- Molecular weight: 220.3505
- IUPAC Standard InChIKey: GSGDTSDELPUTKU-UHFFFAOYSA-N
- CAS Registry Number: 36588-31-5
- Chemical structure:
View 3d structure (requires JavaScript / HTML 5) - Permanent link for this species. Use this link for bookmarking this species for future reference.

Phase change data

Data compiled by: Thermodynamics Research Center, NIST Boulder Laboratories, Chris Muzny director
Quantity | Value | Units | Method | Reference | Comment |
---|---|---|---|---|---|
Tfus | 286.1 | K | N/A | Boelhouwer, Nederbragt, et al., 1950 | Uncertainty assigned by TRC = 2. K |

References

Boelhouwer, Nederbragt, et al., 1950
Boelhouwer, J.W.M.; Nederbragt, G.W.; Verberg, G.W.,
Viscosity data of organic liquids,
Appl. Sci. Res., Sect. A, 1950, 2, 249. [all data]