Hydrazine, 2-butenyl-
- Formula: C4H10N2
- Molecular weight: 86.1356
- IUPAC Standard InChIKey: SHHBQSBSBLLJKJ-NSCUHMNNSA-N
- CAS Registry Number: 36566-68-4
- Chemical structure:
View 3d structure (requires JavaScript / HTML 5) - Other names: Crotylhydrazine

Normal alkane RI, non-polar column, temperature ramp

Column type | Active phase | I | Reference | Comment |
---|---|---|---|---|
Capillary | OV-101 | 830. | Zenkevich, 2005 | 25. m/0.20 mm/0.10 μm, N2/He, 6. K/min; Tstart: 50. C; Tend: 250. C |

References

Zenkevich, 2005
Zenkevich, I.G.,
Experimentally measured retention indices., 2005. [all data]