9H-Carbazole, 2-methyl-
- Formula: C13H11N
- Molecular weight: 181.2331
- IUPAC Standard InChIKey: PWJYOTPKLOICJK-UHFFFAOYSA-N
- CAS Registry Number: 3652-91-3
- Chemical structure:
View 3d structure (requires JavaScript / HTML 5) - Other names: Carbazole, 2-methyl-; 2-Methylcarbazole; 2-Methyldibenzopyrrole; 2-methyl-9H-carbazole

Phase change data

Data compiled by: Thermodynamics Research Center, NIST Boulder Laboratories, Chris Muzny director
Quantity | Value | Units | Method | Reference | Comment |
---|---|---|---|---|---|
Tfus | 532. | K | N/A | Smith and Hall, 1962 | Uncertainty assigned by TRC = 4. K |
Tfus | 532.15 | K | N/A | Borsche, 1908 | Uncertainty assigned by TRC = 2. K |

Lee's RI, non-polar column, temperature ramp

Column type | Active phase | I | Reference | Comment |
---|---|---|---|---|
Capillary | SE-52 | 329.61 | Vassilaros, Kong, et al., 1982 | 20. m/0.30 mm/0.25 μm, H2, 40. C @ 2. min, 4. K/min; Tend: 265. C |

Lee's RI, non-polar column, custom temperature program

Column type | Active phase | I | Reference | Comment |
---|---|---|---|---|
Capillary | HP-5MS | 326.94 | Wang, Li, et al., 2007 | 30. m/0.25 mm/0.25 μm, He; Program: 60C(2min) => 6C/min => 258C => 2C/min => 300C(4min) |
Capillary | HP-5MS | 326.94 | Wang, Li, et al., 2007, 2 | 30. m/0.25 mm/0.25 μm, He; Program: not specified |

References

Smith and Hall, 1962
Smith, P.A.S.; Hall, J.H.,
Kinetic Evidence for the Formation of Azene (Electron-deficient Nitrogen) Intermediates from Aryl Azides,
J. Am. Chem. Soc., 1962, 84, 480-5. [all data]
Borsche, 1908
Borsche, W.,
On tetra- & hexahydrocarbazole compounds and a new carbazole synthesis.,
Justus Liebigs Ann. Chem., 1908, 359, 49. [all data]
Vassilaros, Kong, et al., 1982
Vassilaros, D.L.; Kong, R.C.; Later, D.W.; Lee, M.L.,
Linear retention index system for polycyclic aromatic compounds. Critical evaluation and additional indices,
J. Chromatogr., 1982, 252, 1-20, https://doi.org/10.1016/S0021-9673(01)88394-1
. [all data]
Wang, Li, et al., 2007
Wang, Z.; Li, K.; Lambert, P.; Yang, C.,
Identification, characterization and quantitation of pyrogenic polycylic aromatic hydrocarbons and other organic compounds in tire fire products,
J. Chromatogr. A, 2007, 1139, 1, 14-26, https://doi.org/10.1016/j.chroma.2006.10.085
. [all data]
Wang, Li, et al., 2007, 2
Wang, Z.; Li, K.; Lambert, P.; Brown, C.E.; Yang, C.; Hollebone, B.P.,
Identification and characterization of polycyclic aromatic compounds in tire fire products and differentiation of pyrogenic PAHs from petrogenic PAHs
in Proceedings of the 30th Arctic and Marine Oilspill (AMOP) Technical Seminar. Vol.1, 2007, 61-85. [all data]