Benzenamine, 4-fluoro-3-nitro-
- Formula: C6H5FN2O2
- Molecular weight: 156.1145
- IUPAC Standard InChIKey: LLIOADBCFIXIEU-UHFFFAOYSA-N
- CAS Registry Number: 364-76-1
- Chemical structure:
View 3d structure (requires JavaScript / HTML 5) - Other names: Aniline, 4-fluoro-3-nitro-; 3-Nitro-4-fluoroaniline; 4-Fluoro-3-nitroaniline; 4-Fluoro-3-nitrobenzenamine; 4-F-3NA

Condensed phase thermochemistry data

Data compiled by: Hussein Y. Afeefy, Joel F. Liebman, and Stephen E. Stein
Quantity | Value | Units | Method | Reference | Comment |
---|---|---|---|---|---|
ΔcH°solid | -3083.0 | kJ/mol | Ccb | Swarts, 1919 | Not corrected for CODATA value of ΔfH |

References

Swarts, 1919
Swarts, F.,
Etudes thermochimiques sur les combinaisons organiques fluorees,
J. Chim. Phys., 1919, 17, 3-70. [all data]