α-d-Galactopyranose
- Formula: C6H12O6
- Molecular weight: 180.1559
- IUPAC Standard InChIKey: WQZGKKKJIJFFOK-SXUWKVJYSA-N
- CAS Registry Number: 3646-73-9
- Chemical structure:
View 3d structure (requires JavaScript / HTML 5) - Stereoisomers:
- Other names: α-d-Galactose

Condensed phase thermochemistry data

Data compiled by: Hussein Y. Afeefy, Joel F. Liebman, and Stephen E. Stein
Quantity | Value | Units | Method | Reference | Comment |
---|---|---|---|---|---|
ΔfH°solid | -1286.3 ± 0.54 | kJ/mol | Ccb | Clarke and Stegeman, 1939 | Reanalyzed by Cox and Pilcher, 1970, Original value = -1285.9 kJ/mol |
Quantity | Value | Units | Method | Reference | Comment |
ΔcH°solid | -2789.7 ± 0.42 | kJ/mol | Ccb | Clarke and Stegeman, 1939 | Corresponding ΔfHºsolid = -1286.3 kJ/mol (simple calculation by NIST; no Washburn corrections) |

Reaction thermochemistry data

Data compiled by: Hussein Y. Afeefy, Joel F. Liebman, and Stephen E. Stein
Individual Reactions
By formula: C12H22O11 + H2O = C6H12O6 + C6H12O6
Quantity | Value | Units | Method | Reference | Comment |
---|---|---|---|---|---|
ΔrH° | 0.44 ± 0.11 | kJ/mol | Eqk | Goldberg and Tewari, 1989 | liquid phase; solvent: Aqueous; HPLC |

References

Clarke and Stegeman, 1939
Clarke, T.H.; Stegeman, G.,
Heats of combustion of some mono- and disaccharides,
J. Am. Chem. Soc., 1939, 61, 1726-1730. [all data]
Cox and Pilcher, 1970
Cox, J.D.; Pilcher, G.,
Thermochemistry of Organic and Organometallic Compounds, Academic Press, New York, 1970, 1-636. [all data]
Goldberg and Tewari, 1989
Goldberg, R.N.; Tewari, Y.B.,
A calorimetric and equilibrium investigatino of the hydrolysis of lactose,
J. Biol. Chem., 1989, 264, 9897-9900. [all data]