1,3,7-Tricarbomethoxynaphthalene
- Formula: C16H14O6
- Molecular weight: 302.2788
- IUPAC Standard InChIKey: ZJRNNMZZZGKMTM-UHFFFAOYSA-N
- CAS Registry Number: 36440-30-9
- Chemical structure:
View 3d structure (requires JavaScript / HTML 5) - Permanent link for this species. Use this link for bookmarking this species for future reference.

Phase change data

Data compiled as indicated in comments:
TRC - Thermodynamics Research Center, NIST Boulder Laboratories, Chris Muzny director
AC - William E. Acree, Jr., James S. Chickos
Quantity | Value | Units | Method | Reference | Comment |
---|---|---|---|---|---|
Tfus | 445.7 | K | N/A | Dozen, Fujishima, et al., 1978 | Uncertainty assigned by TRC = 0.1 K; TRC |
Enthalpy of fusion
ΔfusH (kJ/mol) | Temperature (K) | Method | Reference | Comment |
---|---|---|---|---|
37.2 | 446.7 | DSC | Acree, 1993 | AC |

References

Dozen, Fujishima, et al., 1978
Dozen, Y.; Fujishima, S.; Shingu, H.,
Structures and fusion parameters of methoxycarbonyl-benzenes and -naphthalenes,
Thermochim. Acta, 1978, 25, 2, 209, https://doi.org/10.1016/0040-6031(78)85008-4
. [all data]
Acree, 1993
Acree, William E.,
Thermodynamic properties of organic compounds,
Thermochimica Acta, 1993, 219, 97-104, https://doi.org/10.1016/0040-6031(93)80486-T
. [all data]