1,3,5-Trimethyl-1-cyclohexene,c&t
- Formula: C9H16
- Molecular weight: 124.2233
- IUPAC Standard InChIKey: PKHOIUJRGGWFEF-UHFFFAOYSA-N
- CAS Registry Number: 3643-64-9
- Chemical structure:
View 3d structure (requires JavaScript / HTML 5) - Stereoisomers:
- Other names: Cyclohexene, 1,3,5-trimethyl-; 1,3,5-Trimethyl-1-cyclohexene,c&t

Phase change data

Data compiled as indicated in comments:
BS - Robert L. Brown and Stephen E. Stein
TRC - Thermodynamics Research Center, NIST Boulder Laboratories, Chris Muzny director
Quantity | Value | Units | Method | Reference | Comment |
---|---|---|---|---|---|
Tboil | 414.2 | K | N/A | Aldrich Chemical Company Inc., 1990 | BS |
Tboil | 413. | K | N/A | Von Auwers, Hinterseber, et al., 1915 | Uncertainty assigned by TRC = 3. K; TRC |
Tboil | 414.4 | K | N/A | Von Auwers, Hinterseber, et al., 1915 | Uncertainty assigned by TRC = 3. K; TRC |

References

Aldrich Chemical Company Inc., 1990
Aldrich Chemical Company Inc.,
Catalog Handbook of Fine Chemicals, Aldrich Chemical Company, Inc., Milwaukee WI, 1990, 1. [all data]
Von Auwers, Hinterseber, et al., 1915
Von Auwers, K.; Hinterseber, R.; Treppman, W.,
Concerning Simple Hydroaromatic Hydrocarbons, Alcohols and Ketones,
Justus Liebigs Ann. Chem., 1915, 410, 257-287. [all data]