3,4-Dichloroanisole
- Formula: C7H6Cl2O
- Molecular weight: 177.028
- IUPAC Standard InChIKey: VISJRVXHPNMYRH-UHFFFAOYSA-N
- CAS Registry Number: 36404-30-5
- Chemical structure:
View 3d structure (requires JavaScript / HTML 5) - Other names: 3,4-Dichloroanizole; 3,4-Dichlorophenol, methyl ether; Benzene, 1,2-dichloro-4-methoxy; 1,2-Dichloro-4-methoxybenzene

Kovats' RI, non-polar column, isothermal

Column type | Active phase | Temperature (C) | I | Reference | Comment |
---|---|---|---|---|---|
Capillary | SE-30 | 140. | 1275. | Korhonen, 1984 | N2; Column length: 25. m; Column diameter: 0.3 mm |
Capillary | SE-30 | 160. | 1285. | Korhonen, 1984 | N2; Column length: 25. m; Column diameter: 0.3 mm |
Capillary | SE-30 | 180. | 1298. | Korhonen, 1984 | N2; Column length: 25. m; Column diameter: 0.3 mm |

Kovats' RI, polar column, isothermal

Column type | Active phase | Temperature (C) | I | Reference | Comment |
---|---|---|---|---|---|
Capillary | OV-351 | 140. | 1878. | Korhonen, 1984 | N2; Column length: 25. m; Column diameter: 0.32 mm |
Capillary | OV-351 | 160. | 1899. | Korhonen, 1984 | N2; Column length: 25. m; Column diameter: 0.32 mm |
Capillary | OV-351 | 180. | 1900. | Korhonen, 1984 | N2; Column length: 25. m; Column diameter: 0.32 mm |

Van Den Dool and Kratz RI, non-polar column, temperature ramp

Column type | Active phase | I | Reference | Comment |
---|---|---|---|---|
Capillary | SE-30 | 1281. | Korhonen, 1984 | N2, 10. K/min; Column length: 25. m; Column diameter: 0.3 mm; Tstart: 100. C |
Capillary | SE-30 | 1259. | Korhonen, 1984 | N2, 2. K/min; Column length: 25. m; Column diameter: 0.3 mm; Tstart: 100. C |
Capillary | SE-30 | 1271. | Korhonen, 1984 | N2, 6. K/min; Column length: 25. m; Column diameter: 0.3 mm; Tstart: 100. C |

Van Den Dool and Kratz RI, non-polar column, custom temperature program

Column type | Active phase | I | Reference | Comment |
---|---|---|---|---|
Capillary | VF-5MS | 1310.9 | Tret'yakov, 2007 | 30. m/0.25 mm/0.25 μm, He; Program: Multi-step temperature program; T(initial)=60C; T(final)=270C |
Capillary | VF-5MS | 1307.5 | Tret'yakov, 2007 | 30. m/0.25 mm/0.25 μm, He; Program: Multi-step temperature program; T(initial)=60C; T(final)=270C |

Van Den Dool and Kratz RI, polar column, temperature ramp

Column type | Active phase | I | Reference | Comment |
---|---|---|---|---|
Capillary | OV-351 | 1864. | Korhonen, 1984 | N2, 10. K/min; Column length: 25. m; Column diameter: 0.32 mm; Tstart: 100. C |
Capillary | OV-351 | 1846. | Korhonen, 1984 | N2, 2. K/min; Column length: 25. m; Column diameter: 0.32 mm; Tstart: 100. C |
Capillary | OV-351 | 1862. | Korhonen, 1984 | N2, 6. K/min; Column length: 25. m; Column diameter: 0.32 mm; Tstart: 100. C |

Normal alkane RI, non-polar column, temperature ramp

Column type | Active phase | I | Reference | Comment |
---|---|---|---|---|
Capillary | Ultra-1 | 1253. | Okumura, 1991 | 25. m/0.32 mm/0.25 μm, He, 3. K/min; Tstart: 80. C; Tend: 260. C |

Normal alkane RI, non-polar column, custom temperature program

Column type | Active phase | I | Reference | Comment |
---|---|---|---|---|
Capillary | CP Sil 2 | 1246. | Fuhrer, Deissler, et al., 1997 | 55. m/0.25 mm/0.25 μm, N2; Program: 40C(3min) => 20C/min => 80C => 2C/min => 240C(45min) |

References

Korhonen, 1984
Korhonen, I.O.O.,
Gas-Liquid Chromatographic Analyses. XXVIII. Capillary Column Studies of Chlorinated Anisoles,
J. Chromatogr., 1984, 294, 99-116, https://doi.org/10.1016/S0021-9673(01)96118-7
. [all data]
Tret'yakov, 2007
Tret'yakov, K.V.,
Retention Data. NIST Mass Spectrometry Data Center., NIST Mass Spectrometry Data Center, 2007. [all data]
Okumura, 1991
Okumura, T.,
retention indices of environmental chemicals on methyl silicone capillary column,
Journal of Environmental Chemistry (Japan), 1991, 1, 2, 333-358, https://doi.org/10.5985/jec.1.333
. [all data]
Fuhrer, Deissler, et al., 1997
Fuhrer, U.; Deissler, A.; Schreitmuller, J.; Ballschmiter, K.,
Analysis of Halogenated Methoxybenzenes and Hexachlorobenzene (HCB) in the Picogram m-3 Range in Marine Air,
Chromatographia, 1997, 45, 1, 414-427, https://doi.org/10.1007/BF02505594
. [all data]