7-Methylenebicyclo[4.1.0]hept-2-ene
- Formula: C8H10
- Molecular weight: 106.1650
- IUPAC Standard InChIKey: TZXBLRLEPUNRFN-UHFFFAOYSA-N
- CAS Registry Number: 36398-96-6
- Chemical structure:
View 3d structure (requires JavaScript / HTML 5) - Permanent link for this species. Use this link for bookmarking this species for future reference.

Condensed phase thermochemistry data

Data compiled by: Hussein Y. Afeefy, Joel F. Liebman, and Stephen E. Stein
Quantity | Value | Units | Method | Reference | Comment |
---|---|---|---|---|---|
ΔfH°liquid | 209.1 ± 2.2 | kJ/mol | Ccb | Kozina, 1976 | |
Quantity | Value | Units | Method | Reference | Comment |
ΔcH°liquid | -4786.4 ± 2.1 | kJ/mol | Ccb | Kozina, 1976 | Corresponding ΔfHºliquid = 209.2 kJ/mol (simple calculation by NIST; no Washburn corrections) |

References

Kozina, 1976
Kozina, M.P.,
Enthalpies of combustion and formation of bicyclic and polycyclic hydrocarbons,
Sovrem. Probl. Fiz. Khim., 1976, 9, 198-225. [all data]