Propane, 2-cyclopropyl-
- Formula: C6H12
- Molecular weight: 84.1595
- IUPAC Standard InChIKey: HPBROFGYTXOJIO-UHFFFAOYSA-N
- CAS Registry Number: 3638-35-5
- Chemical structure:
View 3d structure (requires JavaScript / HTML 5) - Other names: Cyclopropane, isopropyl-; Cyclopropane, (1-methylethyl)-; Isopropylcyclopropane; 2-Cyclopropylpropane

Phase change data

Data compiled as indicated in comments:
BS - Robert L. Brown and Stephen E. Stein
TRC - Thermodynamics Research Center, NIST Boulder Laboratories, Chris Muzny director
Quantity | Value | Units | Method | Reference | Comment |
---|---|---|---|---|---|
Tboil | 331.6 ± 0.4 | K | AVG | N/A | Average of 7 values; Individual data points |
Quantity | Value | Units | Method | Reference | Comment |
Tfus | 159. ± 4. | K | AVG | N/A | Average of 14 values; Individual data points |

Kovats' RI, non-polar column, isothermal

Column type | Active phase | Temperature (C) | I | Reference | Comment |
---|---|---|---|---|---|
Packed | Squalane | 20. | 570. | Bogoslovsky, Anvaer, et al., 1978 | |
Packed | Squalane | 27. | 570. | Bogoslovsky, Anvaer, et al., 1978 | |
Packed | Squalane | 50. | 572. | Bogoslovsky, Anvaer, et al., 1978 | |
Packed | Squalane | 67. | 575. | Bogoslovsky, Anvaer, et al., 1978 | |
Packed | Squalane | 86. | 577. | Bogoslovsky, Anvaer, et al., 1978 | |
Capillary | Squalane | 120. | 569.9 | Schomburg and Dielmann, 1973 | Column length: 100. m; Column diameter: 0.25 mm |
Packed | Squalane | 27. | 570. | Hively and Hinton, 1968 | He, Chromosorb P; Column length: 15. m; Column diameter: 0.25 mm |
Packed | Squalane | 49. | 572. | Hively and Hinton, 1968 | He, Chromosorb P; Column length: 15. m; Column diameter: 0.25 mm |
Packed | Squalane | 67. | 575. | Hively and Hinton, 1968 | He, Chromosorb P; Column length: 15. m; Column diameter: 0.25 mm |
Packed | Squalane | 86. | 577. | Hively and Hinton, 1968 | He, Chromosorb P; Column length: 15. m; Column diameter: 0.25 mm |

Normal alkane RI, non-polar column, custom temperature program

Column type | Active phase | I | Reference | Comment |
---|---|---|---|---|
Capillary | Squalane | 570. | Chen, 2008 | Program: not specified |

References

Bogoslovsky, Anvaer, et al., 1978
Bogoslovsky, Yu.N.; Anvaer, B.I.; Vigdergauz, M.S.,
Chromatographic constants in gas chromatography (in Russian), Standards Publ. House, Moscow, 1978, 192. [all data]
Schomburg and Dielmann, 1973
Schomburg, G.; Dielmann, G.,
Use of retention increments for identification and correlation of saturated and unsaturated cyclopropane hydrocarbons by means of Kovats indices,
Anal. Chem., 1973, 45, 9, 1647-1658, https://doi.org/10.1021/ac60331a021
. [all data]
Hively and Hinton, 1968
Hively, R.A.; Hinton, R.E.,
Variation of the retention index with temperature on squalane substrates,
J. Gas Chromatogr., 1968, 6, 4, 203-217, https://doi.org/10.1093/chromsci/6.4.203
. [all data]
Chen, 2008
Chen, H.-F.,
Quantitative prediction of gas chromatography retention indices with support vector machines, radial basis neutral networks and multiple linear regression,
Anal. Chim. Acta, 2008, 609, 1, 24-36, https://doi.org/10.1016/j.aca.2008.01.003
. [all data]