4-Piperidinol, 2,2,6,6-tetramethyl-, 1-oxide
- Formula: C9H19NO2
- Molecular weight: 173.2527
- IUPAC Standard InChIKey: CSGAUKGQUCHWDP-UHFFFAOYSA-N
- CAS Registry Number: 3637-10-3
- Chemical structure:
View 3d structure (requires JavaScript / HTML 5) - Other names: 4-Piperidinol, 1-hydroxy-2,2,6,6-tetramethyl-; 1,4-Dihydroxy-2,2,6,6-Tetramethylpiperidine; 1-Hydroxy-2,2,6,6-tetramethyl-4-piperidinol

Gas phase thermochemistry data

Data compiled by: Hussein Y. Afeefy, Joel F. Liebman, and Stephen E. Stein
Quantity | Value | Units | Method | Reference | Comment |
---|---|---|---|---|---|
ΔfH°gas | -345.3 ± 1.9 | kJ/mol | Ccb | Lebedev, Rozantzev, et al., 1966 |

Condensed phase thermochemistry data

Data compiled by: Hussein Y. Afeefy, Joel F. Liebman, and Stephen E. Stein
Quantity | Value | Units | Method | Reference | Comment |
---|---|---|---|---|---|
ΔfH°solid | -445.7 ± 1.4 | kJ/mol | Ccb | Lebedev, Rozantzev, et al., 1966 | |
Quantity | Value | Units | Method | Reference | Comment |
ΔcH°solid | -5811.5 ± 1.4 | kJ/mol | Ccb | Lebedev, Rozantzev, et al., 1966 |

Phase change data

Data compiled as indicated in comments:
AC - William E. Acree, Jr., James S. Chickos
ALS - Hussein Y. Afeefy, Joel F. Liebman, and Stephen E. Stein
Enthalpy of sublimation
ΔsubH (kJ/mol) | Temperature (K) | Method | Reference | Comment |
---|---|---|---|---|
100.4 ± 0.6 | 328. | ME | Lebedev, Rosantsev, et al., 1966 | Based on data from 318. to 348. K. See also Cox and Pilcher, 1970.; AC |
100. ± 0.50 | 313. | V | Kalashnikova, Rozantsev, et al., 1965 | ALS |

References

Lebedev, Rozantzev, et al., 1966
Lebedev, Yu.A.; Rozantzev, E.G.; Kalashnikova, L.A.; Lebedev, V.P.; Neiman, M.B.; Apin, A.Ya.,
Thermochemical study of certain free radicals and the corresponding hydrides,
Dokl. Phys. Chem. (Engl. Transl.), 1966, 168, 460-462, In original 104. [all data]
Lebedev, Rosantsev, et al., 1966
Lebedev, Y.A.; Rosantsev, E.G.; Kalashnikova, L.A.; Lebedev, V.P.; Nieman, M.B.; Apin, Y.A.,
Dokl. Akad. Nauk SSSR, 1966, 168, 1, 104. [all data]
Cox and Pilcher, 1970
Cox, J.D.; Pilcher, G.,
Thermochemistry of Organic and Organometallic Compounds, Academic Press Inc., London, 1970, 643. [all data]
Kalashnikova, Rozantsev, et al., 1965
Kalashnikova, L.A.; Rozantsev, E.G.; Chaikin, A.M.,
Saturated vapor pressure of certain stable free radicals,
Bull. Acad. Sci. USSR, Div. Chem. Sci., 1965, 782-785. [all data]