2,5-Cyclohexadiene-1,4-dione, 2-phenyl-
- Formula: C12H8O2
- Molecular weight: 184.1907
- IUPAC Standard InChIKey: RLQZIECDMISZHS-UHFFFAOYSA-N
- CAS Registry Number: 363-03-1
- Chemical structure:
View 3d structure (requires JavaScript / HTML 5) - Other names: p-Benzoquinone, 2-phenyl-; Phenyl-p-benzoquinone; Phenyl-1,4-benzoquinone; Phenylquinone; 2-Phenyl-p-benzoquinone; 2-Phenyl-1,4-benzoquinone; 2-Phenylbenzoquinone; Phenylbenzoquinone; p-Benzoquinone, phenyl-; 2-Phenylquinone; NSC 2806; 2-Phenylbenzo-1,4-quinone

Gas phase ion energetics data

Data compiled by: John E. Bartmess
Electron affinity determinations
EA (eV) | Method | Reference | Comment |
---|---|---|---|
2.042 ± 0.061 | TDEq | Heinis, Chowdhury, et al., 1988 | ΔGea(423 K) = -45.1 kcal/mol; ΔSea = -5.2 eu |

References

Heinis, Chowdhury, et al., 1988
Heinis, T.; Chowdhury, S.; Scott, S.L.; Kebarle, P.,
Electron Affinities of Benzo-, Naphtho-, and Anthraquinones Determined from Gas-Phase Equilibria Measurements,
J. Am. Chem. Soc., 1988, 110, 2, 400, https://doi.org/10.1021/ja00210a015
. [all data]