1-Methyl-2-isobutylbenzene
- Formula: C11H16
- Molecular weight: 148.2447
- IUPAC Standard InChIKey: XNMPJDZAHSMAMN-UHFFFAOYSA-N
- CAS Registry Number: 36301-29-8
- Chemical structure:
View 3d structure (requires JavaScript / HTML 5) - Other names: Benzene, 1-methyl-2-(2-methylpropyl)-; o-isobutyltoluene; 2-isobutyltoluene

Kovats' RI, non-polar column, custom temperature program

Column type | Active phase | I | Reference | Comment |
---|---|---|---|---|
Capillary | Petrocol DH-100 | 1027.85 | Haagen-Smit Laboratory, 1997 | He; Column length: 100. m; Column diameter: 0.2 mm; Program: 5C(10min) => 5C/min => 50C(48min) => 1.5C/min => 195C(91min) |

Kovats' RI, polar column, isothermal

Column type | Active phase | Temperature (C) | I | Reference | Comment |
---|---|---|---|---|---|
Capillary | Carbowax 20M | 90. | 1331.6 | Döring, Estel, et al., 1974 | Column length: 100. m; Column diameter: 0.2 mm |

Normal alkane RI, polar column, isothermal

Column type | Active phase | Temperature (C) | I | Reference | Comment |
---|---|---|---|---|---|
Capillary | Carbowax 20M | 90. | 1332. | Sutter, Peterson, et al., 1997 |

Normal alkane RI, polar column, custom temperature program

Column type | Active phase | I | Reference | Comment |
---|---|---|---|---|
Capillary | Carbowax 20M | 1332. | Ivanciuc, Ivanciuc, et al., 2001 | Program: not specified |

References

Haagen-Smit Laboratory, 1997
Haagen-Smit Laboratory,
Procedure for the detailed hydrocarbon analysis of gasolines by single column high efficiency (capillary) column gas chromatography, SOP NO. MLD 118, Revision No. 1.1, California Environmental Protection Agency, Air Resources Board, El Monte, California, 1997, 22. [all data]
Döring, Estel, et al., 1974
Döring, C.E.; Estel, D.; Fischer, R.,
Kapillar-gaschromatographische Charakterisierung von C10-bis C12-Aromaten,
J. Prakt. Chem., 1974, 316, 1, 1-12, https://doi.org/10.1002/prac.19743160102
. [all data]
Sutter, Peterson, et al., 1997
Sutter, J.M.; Peterson, T.A.; Jurs, P.C.,
Prediction of gas chromatographic retention indices of alkylbenzenes,
Anal. Chim. Acta., 1997, 342, 2-3, 113-122, https://doi.org/10.1016/S0003-2670(96)00578-8
. [all data]
Ivanciuc, Ivanciuc, et al., 2001
Ivanciuc, O.; Ivanciuc, T.; Klein, D.J.; Seitz, W.A.; Balaban, A.T.,
Quantitative structure-retention relationships for gas chromatographic retention indices of alkylbenzenes with molecular graph descriptors,
SAR QSAR Environ. Res., 2001, 11, 5-6, 419-452, https://doi.org/10.1080/10629360108035362
. [all data]