(R)-2-methyl-1-butanamine
- Formula: C5H13N
- Molecular weight: 87.1634
- IUPAC Standard InChIKey: VJROPLWGFCORRM-YFKPBYRVSA-N
- CAS Registry Number: 36272-22-7
- Chemical structure:
View 3d structure (requires JavaScript / HTML 5) - Stereoisomers:

Phase change data

Data compiled by: Thermodynamics Research Center, NIST Boulder Laboratories, Chris Muzny director
Quantity | Value | Units | Method | Reference | Comment |
---|---|---|---|---|---|
Tboil | 96.5 | K | N/A | Plimpton, 1881 | Uncertainty assigned by TRC = 3. K |

References

Plimpton, 1881
Plimpton, R.T.,
On the Amylamines Corresponding to the Active and Inactive Alcohols of Fermentation,
J. Chem. Soc., 1881, 39, 331. [all data]