Bicyclo[3.1.0]hex-2-ene, 4-methylene-1-(1-methylethyl)-
- Formula: C10H14
- Molecular weight: 134.2182
- IUPAC Standard InChIKey: LBVRQJWOZIMWNY-UHFFFAOYSA-N
- CAS Registry Number: 36262-09-6
- Chemical structure:
View 3d structure (requires JavaScript / HTML 5) - Other names: 1-Isopropyl-4-methylenebicyclo[3.1.0]hex-2-ene; 2,4(10)-Thujadiene; 4-Methylene-1-(1-methylethyl)-bicyclo[3.1.0]hex-2-ene; Dehydrosabinene; Thuja-2,4(10)-diene; 2,4-Thujadiene; Dehydrosabinene (Thuja-2,4(10)-diene)

Kovats' RI, non-polar column, temperature ramp

Column type | Active phase | I | Reference | Comment |
---|---|---|---|---|
Capillary | DB-5 | 960. | Lucero, Fredrickson, et al., 2006 | 30. m/0.25 mm/0.25 μm, He, 3. K/min; Tstart: 60. C |
Capillary | DB-5 | 960. | Adams, Morris, et al., 2005 | 30. m/0.26 mm/0.25 μm, He, 3. K/min; Tstart: 60. C; Tend: 246. C |
Capillary | DB-5 | 957. | Adams and Nguyen, 2005 | 30. m/0.26 mm/0.25 μm, He, 3. K/min; Tstart: 60. C; Tend: 246. C |
Capillary | DB-5MS | 955. | Maia, Andrade, et al., 2005 | 30. m/0.25 mm/0.25 μm, He, 3. K/min; Tstart: 60. C; Tend: 240. C |
Capillary | HP-5 | 958. | Lopes, Strobl, et al., 2004 | 30. m/0.25 mm/0.25 μm, He, 3. K/min; Tstart: 60. C; Tend: 260. C |
Capillary | CP Sil 5 CB | 953. | Kasali, Adio, et al., 2002 | He, 3. K/min; Column length: 25. m; Column diameter: 0.25 mm; Tstart: 50. C; Tend: 230. C |
Capillary | HP-5MS | 956. | Salido, Altarejos, et al., 2002 | 30. m/0.25 mm/0.25 μm, He, 3. K/min; Tstart: 50. C; Tend: 250. C |
Capillary | SE-54 | 957. | Adams, 2000 | 30. m/0.26 mm/0.25 μm, He, 3. K/min; Tstart: 60. C; Tend: 246. C |
Capillary | DB-5 | 957. | Adams, 2000, 2 | 30. m/0.26 mm/0.25 μm, He, 3. K/min; Tstart: 60. C; Tend: 240. C |
Capillary | SE-54 | 957. | Adams, 2000, 3 | 30. m/0.26 mm/0.25 μm, 3. K/min; Tstart: 60. C; Tend: 246. C |
Capillary | DB-5 | 957. | Adams, 2000, 4 | 30. m/0.26 mm/0.25 μm, He, 3. K/min; Tstart: 60. C; Tend: 246. C |
Capillary | DB-5 | 956. | Tzakou, Harvala, et al., 2000 | 50. C @ 5. min, 3. K/min; Column length: 30. m; Column diameter: 0.32 mm; Tend: 250. C |
Capillary | DB-5 | 957. | Adams, 1999 | 30. m/0.26 mm/0.25 μm, He, 3. K/min; Tstart: 60. C; Tend: 246. C |

Kovats' RI, non-polar column, custom temperature program

Column type | Active phase | I | Reference | Comment |
---|---|---|---|---|
Capillary | DB-5 | 957. | Adams, 1998 | 30. m/0.26 mm/0.25 μm; Program: not specified |

Kovats' RI, polar column, temperature ramp

Column type | Active phase | I | Reference | Comment |
---|---|---|---|---|
Capillary | DB-Wax | 1117. | Lopes, Strobl, et al., 2004 | 30. m/0.32 mm/0.25 μm, He, 40. C @ 5. min, 3. K/min; Tend: 220. C |

Van Den Dool and Kratz RI, non-polar column, temperature ramp

Column type | Active phase | I | Reference | Comment |
---|---|---|---|---|
Capillary | HP-5MS | 954. | Benkaci-Ali, Baaliouamer, et al., 2007 | 30. m/0.25 mm/0.25 μm, He, 60. C @ 8. min, 2. K/min, 250. C @ 30. min |
Capillary | HP-5MS | 955. | Saroglou, Arfan, et al., 2007 | 30. m/0.25 mm/0.25 μm, He, 60. C @ 5. min, 4. K/min; Tend: 280. C |
Capillary | DB-5 | 958. | Dob, Dahmane, et al., 2006 | 30. m/0.32 mm/0.25 μm, N2, 60. C @ 3. min, 3. K/min, 240. C @ 5. min |
Capillary | HP-5MS | 954. | Saroglou, Dorizas, et al., 2006 | 30. m/0.25 mm/0.25 μm, He, 60. C @ 5. min, 4. K/min; Tend: 280. C |
Capillary | HP-5 | 959. | Cioni, Flamini, et al., 2005 | 30. m/0.25 mm/0.25 μm, N2, 60. C @ 10. min, 5. K/min; Tend: 220. C |
Capillary | HP-5 | 957. | Javidnia, Miri, et al., 2005 | 30. m/0.25 mm/0.25 μm, He, 3. K/min; Tstart: 60. C; Tend: 260. C |
Capillary | SE-54 | 955. | Alma, Nitz, et al., 2004 | 30. m/0.25 mm/0.25 μm, He, 60. C @ 5. min, 2. K/min; Tend: 260. C |
Capillary | HP-5 | 959. | Ceccarini, Macchia, et al., 2004 | 30. m/0.25 mm/0.25 μm, 60. C @ 10. min, 5. K/min; Tend: 220. C |
Capillary | DB-5 | 959. | Flamini, Cioni, et al., 2004 | 30. m/0.25 mm/0.25 μm, N2, 3. K/min; Tstart: 60. C; Tend: 240. C |
Capillary | HP-5 | 953. | Javidnia, Miri, et al., 2004 | He, 3. K/min; Column length: 30. m; Column diameter: 0.25 mm; Tstart: 60. C; Tend: 260. C |
Capillary | DB-5 | 958. | Javidnia, Miri, et al., 2004, 2 | 30. m/0.25 mm/0.25 μm, He, 3. K/min; Tstart: 60. C; Tend: 260. C |
Capillary | OV-1 | 957. | Bicchi, Rubiolo, et al., 2003 | 25. m/0.25 mm/0.3 μm, H2, 50. C @ 1. min, 3. K/min, 200. C @ 20. min |
Capillary | DB-5 | 955. | Javidnia, Miri, et al., 2003 | He, 4. K/min; Column length: 25. m; Column diameter: 0.25 mm; Tstart: 60. C; Tend: 260. C |
Capillary | HP-5 | 958. | Macchioni, Cioni, et al., 2003 | 30. m/0.25 mm/0.25 μm, He, 3. K/min; Tstart: 60. C; Tend: 240. C |
Capillary | HP-5MS | 956. | Salido, Altarejos, et al., 2003 | 30. m/0.25 mm/0.25 μm, He, 3. K/min; Tstart: 50. C; Tend: 250. C |
Capillary | HP-5MS | 951. | Couladis, Chinou, et al., 2002 | 30. m/0.25 mm/0.25 μm, He, 3. K/min; Tstart: 60. C; Tend: 300. C |
Capillary | RTX-5 | 956. | Shellie, Mondello, et al., 2002 | 30. m/0.25 mm/0.25 μm, He, 45. C @ 6. min, 3. K/min; Tend: 250. C |
Capillary | RTX-5 | 957. | Shellie, Mondello, et al., 2002 | 30. m/0.25 mm/0.25 μm, He, 45. C @ 6. min, 3. K/min; Tend: 250. C |
Capillary | OV-1 | 937. | Bicchi, Rubiolo, et al., 1998 | 25. m/0.25 mm/0.3 μm, 50. C @ 1. min, 3. K/min, 200. C @ 20. min |

Van Den Dool and Kratz RI, non-polar column, custom temperature program

Column type | Active phase | I | Reference | Comment |
---|---|---|---|---|
Capillary | HP-5MS | 955.8 | Andriamaharavo, 2014 | 30. m/0.25 mm/0.25 μm, He; Program: 60C (1 min) => 5 C/min => 210C => 10 C/min => 280C (15 min) |

Van Den Dool and Kratz RI, polar column, temperature ramp

Column type | Active phase | I | Reference | Comment |
---|---|---|---|---|
Capillary | Carbowax 20M | 1109. | Bicchi, Rubiolo, et al., 2003 | 25. m/0.25 mm/0.3 μm, He, 50. C @ 1. min, 3. K/min, 200. C @ 20. min |

Normal alkane RI, non-polar column, temperature ramp

Column type | Active phase | I | Reference | Comment |
---|---|---|---|---|
Capillary | DB-5 | 945. | Cao, Li, et al., 2011 | 30. m/0.25 mm/0.25 μm, Helium, 40. C @ 5. min, 3. K/min, 250. C @ 20. min |
Capillary | DB-5 | 974. | Porto, Decorti, et al., 2009 | 30. m/0.25 mm/0.25 μm, Helium, 45. C @ 3. min, 3. K/min, 250. C @ 5. min |
Capillary | HP-5 | 959. | Flamini, Tebano, et al., 2008 | 30. m/0.25 mm/0.25 μm, N2, 60. C @ 10. min, 5. K/min; Tend: 220. C |
Capillary | HP-5 MS | 957. | Adams, Beauchamp, et al., 2007 | 30. m/0.25 mm/0.25 μm, Helium, 50. C @ 10. min, 3. K/min, 230. C @ 10. min |
Capillary | DB-5MS | 956. | Andrade, Oliveira, et al., 2007 | 30. m/0.25 mm/0.25 μm, He, 3. K/min; Tstart: 60. C; Tend: 240. C |
Capillary | DB-1 | 940. | Monser-Esfahani, Karamkhani, et al., 2007 | 30. m/0.25 mm/0.25 μm, Helium, 50. C @ 1. min, 2.5 K/min, 260. C @ 20. min |
Capillary | DB-1 | 939. | Pala-Paul, Brophy, et al., 2007 | 50. m/0.25 mm/0.25 μm, He, 4. K/min; Tstart: 95. C; Tend: 240. C |
Capillary | HP-5 | 946. | Ristic, Krivokuca-Dokic, et al., 2007 | 30. m/0.25 mm/0.25 μm, Helium, 4. K/min; Tstart: 40. C; Tend: 260. C |
Capillary | DB-5 | 953. | Sefidkon, Abbasi, et al., 2007 | 30. m/0.25 mm/0.25 μm, He, 4. K/min; Tstart: 50. C; Tend: 240. C |
Capillary | HP-5 MS | 960. | Vagionas, Graikou, et al., 2007 | 30. m/0.25 mm/0.25 μm, Helium, 3. K/min; Tstart: 60. C; Tend: 280. C |
Capillary | HP-5MS | 979. | Vichi, Riu-Aumatell, et al., 2007 | 30. m/0.25 mm/0.25 μm, He, 40. C @ 5. min, 3. K/min, 250. C @ 10. min |
Capillary | SPB-1 | 947. | Cavaleiro, Pinto, et al., 2006 | 30. m/0.20 mm/0.20 μm, Helium, 3. K/min, 220. C @ 15. min; Tstart: 70. C |
Capillary | HP-5 | 944. | Figuérédo, Cabassu, et al., 2006 | 30. m/0.25 mm/0.25 μm, He, 50. C @ 5. min, 5. K/min, 300. C @ 5. min |
Capillary | DB-5 | 962. | Morteza-Semnani K., Saeedi M., et al., 2006 | 30. m/0.25 mm/0.25 μm, He, 60. C @ 5. min, 4. K/min; Tend: 220. C |
Capillary | DB-5 | 958. | Chagonda and Chalchat, 2005 | 50. m/0.3 mm/0.25 μm, 2. K/min; Tstart: 60. C; Tend: 240. C |
Capillary | HP-1 | 947. | Fernandez, Lizzani-Cuvelier, et al., 2005 | 50. m/0.2 mm/0.25 μm, 60. C @ 60. min, 2. K/min; Tend: 250. C |
Capillary | HP-5 | 944. | Figuérédo, Cabassu, et al., 2005 | 30. m/0.25 mm/0.25 μm, He, 50. C @ 5. min, 5. K/min, 300. C @ 5. min |
Capillary | DB-1 | 943. | Khalighi-Sigaroodi, Hadijiakhoondi, et al., 2005 | 30. m/0.25 mm/0.25 μm, He, 50. C @ 1. min, 2.5 K/min, 265. C @ 30. min |
Capillary | HP-5MS | 955. | Sajjadi and Ghannadi, 2005 | 30. m/0.25 mm/0.25 μm, He, 4. K/min; Tstart: 60. C; Tend: 275. C |
Capillary | DB-1 | 943. | Velasco-Negueruela, Pérez-Alonso, et al., 2005 | 50. m/0.25 mm/0.25 μm, 3. K/min; Tstart: 60. C; Tend: 240. C |
Capillary | DB-1 | 953. | Perez-Alonso, Velasco-Negueruela, et al., 2003 | 50. m/0.25 mm/0.25 μm, N2, 4. K/min; Tstart: 95. C; Tend: 240. C |
Capillary | DB-5 | 955. | Zoghbi, Andrade, et al., 2003 | 30. m/0.25 mm/0.25 μm, He, 3. K/min; Tstart: 60. C; Tend: 240. C |
Capillary | HP-5 | 958. | Gallori, Flamini, et al., 2001 | 30. m/0.25 mm/0.25 μm, N2, 60. C @ 10. min, 5. K/min; Tend: 220. C |
Capillary | DB-5 | 959. | Tellez, Canel, et al., 1999 | 30. m/0.25 mm/0.25 μm, He, 3. K/min; Tstart: 60. C; Tend: 240. C |
Capillary | SPB-5 | 945. | Doneanu and Anitescu, 1998 | 50. m/0.32 mm/0.25 μm, He, 3. K/min, 240. C @ 20. min; Tstart: 60. C |

Normal alkane RI, non-polar column, custom temperature program

Column type | Active phase | I | Reference | Comment |
---|---|---|---|---|
Capillary | DB-5 | 952. | Cao, Li, et al., 2011 | 30. m/0.25 mm/0.25 μm, Helium; Program: not specified |
Capillary | DB-5 | 956. | Porto, Decorti, et al., 2009 | 30. m/0.25 mm/0.25 μm, Helium; Program: not specified |
Capillary | SLB-5 MS | 953. | Costa, De Fina, et al., 2008 | 30. m/0.25 mm/0.25 μm, Helium; Program: 50 0C 3 0C/min -> 250 0C (1 min) 10 0C/min -> 300 0C (5 min) |
Capillary | SLB-5 MS | 953. | Costa, De Fina, et al., 2008 | 30. m/0.25 mm/0.25 μm, Helium; Program: not specified |
Capillary | BPX-5 | 951. | Ozer H., Sokmen M., et al., 2007 | 30. m/0.25 mm/0.25 μm, He; Program: 50C => 3C/min => 150C(10min) => 10C/min => 250C |
Capillary | HP-5 | 960. | Ristic, Krivokuca-Dokic, et al., 2007 | 30. m/0.25 mm/0.25 μm, Helium; Program: not specified |
Capillary | SE-52 | 958. | Tognolini, Barocelli, et al., 2006 | 30. m/0.32 mm/0.15 μm, He; Program: 45C => 1C/min => 100C => 5C/min => 250C (10min) |
Capillary | DB-5 | 946. | Hamm, Bleton, et al., 2005 | 30. m/0.25 mm/0.25 μm, He; Program: 40C(1min) => 9C/min => 130C => 2C/min => 230C |
Capillary | DB-5 | 952. | Hamm, Bleton, et al., 2005 | 30. m/0.25 mm/0.25 μm, He; Program: 40C(1min) => 9C/min => 130C => 2C/min => 230C |
Capillary | OV-1 | 938. | Hafez and Abdel-Salam, 2004 | 30. m/0.25 mm/0.25 μm, He; Program: 45 0C (4 min) 3 0C/min -> 75 0C 4 0C/min -> 115 0C 6 0C/min -> 312 0C |
Capillary | DB-5 | 952. | Hamm, Bleton, et al., 2004 | 30. m/0.25 mm/0.25 μm, He; Program: 40C(1min) => 9C/min => 130C => 2C/min => 230C |
Capillary | SE-30 | 939. | Vinogradov, 2004 | Program: not specified |
Capillary | CP Sil 5 CB | 954. | Weyerstahl, Marschall, et al., 1997 | N2; Column length: 30. m; Column diameter: 0.25 mm; Program: not specified |
Capillary | Methyl Silicone | 939. | Zenkevich, 1996 | Program: not specified |

Normal alkane RI, polar column, temperature ramp

Column type | Active phase | I | Reference | Comment |
---|---|---|---|---|
Capillary | TC-FFAP | 1137. | Kurose, Okamura, et al., 2007 | He, 3. K/min, 220. C @ 30. min; Column diameter: 0.25 mm; Phase thickness: 0.25 μm; Tstart: 60. C |
Capillary | Supelcowax-10 | 1131. | Vichi, Riu-Aumatell, et al., 2007 | 30. m/0.25 mm/0.25 μm, He, 40. C @ 5. min, 3. K/min, 250. C @ 10. min |
Capillary | Carbowax 20M | 1116. | Fernandez, Lizzani-Cuvelier, et al., 2005 | 50. m/0.2 mm/0.25 μm, 60. C @ 60. min, 2. K/min; Tend: 250. C |

Normal alkane RI, polar column, custom temperature program

Column type | Active phase | I | Reference | Comment |
---|---|---|---|---|
Capillary | HP Innowax FSP | 1135. | Wedge, Klun, et al., 2009 | 60. m/0.25 mm/0.25 μm, Helium; Program: 60 0C (10 min) 4 0C/min -> 220 0C (10 min) 1 0C/min -> 240 0C (20 min) |

References

Lucero, Fredrickson, et al., 2006
Lucero, M.E.; Fredrickson, E.L.; Estell, R.E.; Morrison, A.A.; Richman, D.B.,
Volatile Composition of Gutierrezia sarothrae (Broom Snakeweed) as Determined by Steam Distillation and Solid Phase Microextraction,
J. Essent. Oil Res., 2006, 18, 2, 121-125, https://doi.org/10.1080/10412905.2006.9699039
. [all data]
Adams, Morris, et al., 2005
Adams, R.P.; Morris, J.A.; Pandey, R.N.; Schwarzbach, A.E.,
Cryptic speciation between Juniperus deltoides and Juniperus oxycedrus (Cupressaceae) in the Mediterranean,
Biochem. Syst. Ecol., 2005, 33, 8, 771-787, https://doi.org/10.1016/j.bse.2005.01.001
. [all data]
Adams and Nguyen, 2005
Adams, R.P.; Nguyen, S.,
Infra-specific variation in Juniperus deppeana and F. Sperryi in the Davis Mountains of Texas: variation in leaf essential oils and random amplified polymorphic DNAS (RAPDS),
Phytologia, 2005, 87, 2, 96-108. [all data]
Maia, Andrade, et al., 2005
Maia, J.G.S.; Andrade, E.H.A.; da Silva, A.C.M.; Oliveira, J.; Carreira, L.M.M.; Araújo, J.S.,
Leaf volatile oils from four Brazilian Xylopia species,
Flavour Fragr. J., 2005, 20, 5, 474-477, https://doi.org/10.1002/ffj.1499
. [all data]
Lopes, Strobl, et al., 2004
Lopes, D.; Strobl, H.; Kolodziejczyk, P.,
14-Methylpentadecano-15-lactone (Muscolide): a new macrocyclic lactone from the oil of Angelica archangelica L.,
Chemistry and Biodiversity, 2004, 1, 12, 1880-1887, https://doi.org/10.1002/cbdv.200490144
. [all data]
Kasali, Adio, et al., 2002
Kasali, A.A.; Adio, A.M.; Oyedeji, A.O.; Eshilokun, A.O.; Adefenwa, M.,
Volatile constituents of Boswellia serrata Roxb. (Burseraceae) bark,
Flavour Fragr. J., 2002, 17, 6, 462-464, https://doi.org/10.1002/ffj.1124
. [all data]
Salido, Altarejos, et al., 2002
Salido, S.; Altarejos, J.; Nogueras, M.; Sánchez, A.; Pannecouque, C.; Witvrouw, M.; De Clercq, E.,
Chemical studies of essential oils of Juniperus oxycedrus ssp. badia,
J. Ethnopharmacol., 2002, 81, 1, 129-134, https://doi.org/10.1016/S0378-8741(02)00045-4
. [all data]
Adams, 2000
Adams, R.P.,
Systematics of smooth leaf margin Juniperus of the western hemisphere based on leaf essential oils and RAPD DNA fingerprinting,
Biochem. Syst. Ecol., 2000, 28, 2, 149-162, https://doi.org/10.1016/S0305-1978(99)00047-2
. [all data]
Adams, 2000, 2
Adams, R.P.,
Systematics of Juniperus section Juniperus based on leaf essential oils and random amplified polymorphic DNAs (RAPDs),
Biochem. Syst. Ecol., 2000, 28, 6, 515-528, https://doi.org/10.1016/S0305-1978(99)00089-7
. [all data]
Adams, 2000, 3
Adams, R.P.,
Systematics of the one seeded Juniperus of the eastern hemisphere based on leaf essential oils and random amplified polymorphic DNAs (RAPDs),
Biochem. Syst. Ecol., 2000, 28, 6, 529-543, https://doi.org/10.1016/S0305-1978(99)00096-4
. [all data]
Adams, 2000, 4
Adams, R.P.,
The serrate leaf margined Juniperus (Section Sabina) of the western hemisphere: systematics and evolution based on leaf essential oils and Random Amplified Polymorphic DNAs (RAPDs),
Biochem. Syst. Ecol., 2000, 28, 10, 975-989, https://doi.org/10.1016/S0305-1978(00)00022-3
. [all data]
Tzakou, Harvala, et al., 2000
Tzakou, O.; Harvala, C.; Galati, E.M.; Sanogo, R.,
Essential oil composition of Nepeta argolica Borey et Chaub. subsp. argolica,
Flavour Fragr. J., 2000, 15, 2, 115-118, https://doi.org/10.1002/(SICI)1099-1026(200003/04)15:2<115::AID-FFJ877>3.0.CO;2-9
. [all data]
Adams, 1999
Adams, R.P.,
Systematics of multi-seeded eastern hemisphere Juniperus based on leaf essential oils and RAPD DNA fingerprinting,
Biochem. Syst. Ecol., 1999, 27, 7, 709-725, https://doi.org/10.1016/S0305-1978(99)00016-2
. [all data]
Adams, 1998
Adams, R.P.,
The essential oils and chemotaxonomy of Juniperus sect. Juniperus,
Biochem. Syst. Ecol., 1998, 26, 6, 637-645, https://doi.org/10.1016/S0305-1978(98)00020-9
. [all data]
Benkaci-Ali, Baaliouamer, et al., 2007
Benkaci-Ali, F.; Baaliouamer, A.; Meklati, B.Y.; Chemat, F.,
Chemical composition of seed essential oils from Algerian Nigella sativa extracted by microwave and hydrodistillation,
Flavour Fragr. J., 2007, 22, 2, 148-153, https://doi.org/10.1002/ffj.1773
. [all data]
Saroglou, Arfan, et al., 2007
Saroglou, V.; Arfan, M.; Shabir, A.; Hadjipavlou-Litina, D.; Skaltsa, H.,
Composition and antioxidant activity of the essential oil of Teucrium royleanum Wall. ex Benth growing in Pakistan,
Flavour Fragr. J., 2007, 22, 2, 154-157, https://doi.org/10.1002/ffj.1774
. [all data]
Dob, Dahmane, et al., 2006
Dob, T.; Dahmane, D.; Chelghoum, C.,
Essential oil composition of Juniperus oxycedrus growing in Algeria,
Pharm. Biol., 2006, 44, 1, 1-6, https://doi.org/10.1080/13880200500530922
. [all data]
Saroglou, Dorizas, et al., 2006
Saroglou, V.; Dorizas, N.; Kypriotakis, Z.; Skaltsa, H.D.,
Analysis of the essential oil composition of eight Anthemis species from Greece,
J. Chromatogr. A, 2006, 1104, 1-2, 313-322, https://doi.org/10.1016/j.chroma.2005.11.087
. [all data]
Cioni, Flamini, et al., 2005
Cioni, P.L.; Flamini, G.; Caponi, C.; Ceccarini, L.; Morelli, I.,
Analysis of volatile fraction, fixed oil and tegumental waxes of the seeds of two different cultivars of Helianthus annuus,
Food Chem., 2005, 90, 4, 713-717, https://doi.org/10.1016/j.foodchem.2004.04.031
. [all data]
Javidnia, Miri, et al., 2005
Javidnia, K.; Miri, R.; Kamalinejad, M.; Edraki, N.,
Chemical composition of Ferula persica Wild. essential oil from Iran,
Flavour Fragr. J., 2005, 20, 6, 605-606, https://doi.org/10.1002/ffj.1496
. [all data]
Alma, Nitz, et al., 2004
Alma, M.H.; Nitz, S.; Kollmannsberger, H.; Digrak, M.; Efe, F.T.; Yilmaz, N.,
Chemical composition and antimicrobial activity of the essential oils from the gum of Turkish Pistachio (Pistacia vera L.),
J. Agric. Food Chem., 2004, 52, 12, 3911-3914, https://doi.org/10.1021/jf040014e
. [all data]
Ceccarini, Macchia, et al., 2004
Ceccarini, L.; Macchia, M.; Flamini, G.; Cioni, P.L.; Caponi, C.; Morelli, I.,
Essential oil composition of Helianthus annuus L. leaves and heads of two cultivated hybride Carlos and Florom 350,
Ind. Crops Prod., 2004, 19, 1, 13-17, https://doi.org/10.1016/S0926-6690(03)00076-1
. [all data]
Flamini, Cioni, et al., 2004
Flamini, G.; Cioni, P.L.; Morelli, I.; Maccioni, S.; Baldini, R.,
Phytochemical typologies in some populations of Myrtus communis L. on Caprione Promontory (East Liguria, Italy),
Food Chem., 2004, 85, 4, 599-604, https://doi.org/10.1016/j.foodchem.2003.08.005
. [all data]
Javidnia, Miri, et al., 2004
Javidnia, K.; Miri, R.; Kamalinejad, M.; Sarkarzadeh, H.; Jamalian, A.,
Chemical composition of the essential oils of Anthemis altissima L. grown in Iran,
Flavour Fragr. J., 2004, 19, 3, 213-216, https://doi.org/10.1002/ffj.1277
. [all data]
Javidnia, Miri, et al., 2004, 2
Javidnia, K.; Miri, R.; Sadeghpour, H.,
Composition of the volatile oil of Achillea wilhelmsii C. Koch from Iran,
DARU, 2004, 12, 2, 63-66, retrieved from http://www1.tums.ac.ir/daru/. [all data]
Bicchi, Rubiolo, et al., 2003
Bicchi, C.; Rubiolo, P.; Camargo, E.E.S.; Vilegas, W.; Gracioso, J.S.; Brito, A.R.M.S.,
Components of Turnera diffusa Willd. var. afrodisiaca (Ward) Urb. essential oil,
Flavour Fragr. J., 2003, 18, 1, 59-61, https://doi.org/10.1002/ffj.1155
. [all data]
Javidnia, Miri, et al., 2003
Javidnia, K.; Miri, R.; Azarpira, A.; Tabaei, S.M.H.,
Composition of the essential oil of Stachys setifera C.A. Mey ssp. iranica growing in Iran,
Flavour Fragr. J., 2003, 18, 4, 299-300, https://doi.org/10.1002/ffj.1165
. [all data]
Macchioni, Cioni, et al., 2003
Macchioni, F.; Cioni, P.L.; Flamini, G.; Morelli, I.; Maccioni, S.; Ansaldi, M.,
Chemical composition of essential oils from needles, branches and cones of Pinus pinea, P. halepensis, P. pinaster and P. nigra from central Italy,
Flavour Fragr. J., 2003, 18, 2, 139-143, https://doi.org/10.1002/ffj.1178
. [all data]
Salido, Altarejos, et al., 2003
Salido, S.; Altarejos, J.; Nogueras, M.; Sánchez, A.; Luque, P.,
Chemical composition and seasonal variations of rosemary oil from Southern Spain,
J. Essent. Oil Res., 2003, 15, 1, 10-14, https://doi.org/10.1080/10412905.2003.9712248
. [all data]
Couladis, Chinou, et al., 2002
Couladis, M.; Chinou, I.B.; Tzakou, O.; Loukis, A.,
Composition and antimicrobial activity of the essential oil of Ballota pseudodictamnus L. Bentham,
Phytother. Res., 2002, 16, 8, 723-726, https://doi.org/10.1002/ptr.1043
. [all data]
Shellie, Mondello, et al., 2002
Shellie, R.; Mondello, L.; Marriott, P.; Dugo, G.,
Characterisation of lavender essential oils by using gas chromatography-mass spectrometry with correlation of linear retention indices and comparison with comprehensive two-dimensional gas chromatography,
J. Chromatogr. A, 2002, 970, 1-2, 225-234, https://doi.org/10.1016/S0021-9673(02)00653-2
. [all data]
Bicchi, Rubiolo, et al., 1998
Bicchi, C.; Rubiolo, P.; Marschall, H.; Weyerstahl, P.; Laurent, R.,
Constituents of Artemisia roxburghiana Besser essential oil,
Flavour Fragr. J., 1998, 13, 1, 40-46, https://doi.org/10.1002/(SICI)1099-1026(199801/02)13:1<40::AID-FFJ688>3.0.CO;2-Z
. [all data]
Andriamaharavo, 2014
Andriamaharavo, N.R.,
Retention Data. NIST Mass Spectrometry Data Center., NIST Mass Spectrometry Data Center, 2014. [all data]
Cao, Li, et al., 2011
Cao, H.; Li, Z.; Chen, X.,
QSRR study of GC retention indices of volatile compounds emitted from Mosla chinensis Maxim. by multiply linear regression,
Chin. J. Chem., 2011, 29, 10, 2187-2196, https://doi.org/10.1002/cjoc.201180379
. [all data]
Porto, Decorti, et al., 2009
Porto, C.Da.; Decorti, D.; Kikic, I.,
Flavour compounds of Lavandula angustifolia L. to use in food manufacturing: comparison of three different extraction methods,
Food Chem., 2009, 112, 4, 1072-1078, https://doi.org/10.1016/j.foodchem.2008.07.015
. [all data]
Flamini, Tebano, et al., 2008
Flamini, G.; Tebano, M.; Cioni, P.L.,
Composition of the essential oils from leafy parts of the shoots, flowers and fruits of Eryngium amethystinum from Amiata Mount (Tuscany, Italy),
Food Chem., 2008, 107, 2, 671-674, https://doi.org/10.1016/j.foodchem.2007.08.064
. [all data]
Adams, Beauchamp, et al., 2007
Adams, R.P.; Beauchamp, P.S.; Dev, V.; Dutz, S.M.,
New Natural Products Isolated from One-Seeded Juniperus of the Southwestern United States: Isolation and Occurence of 2-Ethenyl-3-methyl Phanol and Its Derivatives,
J. Essent. Oil Res., 2007, 19, 2, 146-152, https://doi.org/10.1080/10412905.2007.9699247
. [all data]
Andrade, Oliveira, et al., 2007
Andrade, E.H.A.; Oliveira, J.; Zoghbi, M.G.B.,
Volatiles of Anaxagorea dolichocarpa Spreng. Sandw. and Annona densicoma Mart. Growing Wild in the State of Pará, Brazil,
Flavour Fragr. J., 2007, 22, 2, 158-160, https://doi.org/10.1002/ffj.1776
. [all data]
Monser-Esfahani, Karamkhani, et al., 2007
Monser-Esfahani, H.R.; Karamkhani, F.; Nickavar, B.; Abdi, K.; Faramarzi, M.A.,
The Volatile Constituents of Dracocephalum kotschyi Oils,
Chem. Nat. Comp., 2007, 43, 1, 40-43, https://doi.org/10.1007/s10600-007-0027-z
. [all data]
Pala-Paul, Brophy, et al., 2007
Pala-Paul, J.; Brophy, J.J.; Perez-Alonso, M.J.; Usano, J.; Soria, S.C.,
Essential oil composition of the different parts of Eryngium corniculatum Lam. (Apiaceae) from Spain,
J. Chromatogr. A, 2007, 1175, 2, 289-293, https://doi.org/10.1016/j.chroma.2007.10.061
. [all data]
Ristic, Krivokuca-Dokic, et al., 2007
Ristic, M.; Krivokuca-Dokic, D.; Radanovic, D.; Nastovski, T.,
Etarsko ulje Arnica montata i Arnica chamissonis,
Hem. Ind., 2007, 61, 5, 272-277, https://doi.org/10.2298/HEMIND0704272R
. [all data]
Sefidkon, Abbasi, et al., 2007
Sefidkon, F.; Abbasi, K.; Jamzad, Z.; Ahmadi, S.,
The effect of distillation methods and stage of plant growth on the essential oil content and composition of Satureja rechingeri Jamzad,
Food Chem., 2007, 100, 3, 1054-1058, https://doi.org/10.1016/j.foodchem.2005.11.016
. [all data]
Vagionas, Graikou, et al., 2007
Vagionas, K.; Graikou, K.; Ngassapa, O.; Runyoro, D.; Chinou, I.,
Composition and antimicrobial activity of the essential oils of three Satureja species growing in Tansania,
Food Chem., 2007, 103, 2, 319-324, https://doi.org/10.1016/j.foodchem.2006.07.051
. [all data]
Vichi, Riu-Aumatell, et al., 2007
Vichi, S.; Riu-Aumatell, M.; Mora-Pons, M.; Guadayol, J.M.; Buxaderas, S.; López-Tamames, E.,
Analytical, Nutritional and Clinical Methods. HS-SPME coupled to GC/MS for quality control of Juniperus communis L. berries used for gin aromatization,
Food Chem., 2007, 105, 4, 1748-1754, https://doi.org/10.1016/j.foodchem.2007.03.026
. [all data]
Cavaleiro, Pinto, et al., 2006
Cavaleiro, C.; Pinto, E.; Gonsales, M.J.; Salguero, L.,
Antifungal activity of Juniperus essential oils agains dermatophyte, Asrgillus and Candida strains,
J. Appl. Microbiol., 2006, 100, 6, 1333-1338, https://doi.org/10.1111/j.1365-2672.2006.02862.x
. [all data]
Figuérédo, Cabassu, et al., 2006
Figuérédo, G.; Cabassu, P.; Chalchat, J.-C.; Pasquier, B.,
Studies of Mediterranean oregano populations. VIII. Chemical composition of essential oils of oreganos of various origins,
Flavour Fragr. J., 2006, 21, 1, 134-139, https://doi.org/10.1002/ffj.1543
. [all data]
Morteza-Semnani K., Saeedi M., et al., 2006
Morteza-Semnani K.; Saeedi M.; Changizi S.,
The essential oil composition of Hypericum scabrum L. from Iran,
Flavour Fragr. J., 2006, 21, 3, 513-515, https://doi.org/10.1002/ffj.1614
. [all data]
Chagonda and Chalchat, 2005
Chagonda, L.S.; Chalchat, J.-C.,
The essential oil of wild and cultivated Hoslundia opposita Vahl. from Zimbabwe,
Flavour Fragr. J., 2005, 20, 2, 193-195, https://doi.org/10.1002/ffj.1402
. [all data]
Fernandez, Lizzani-Cuvelier, et al., 2005
Fernandez, X.; Lizzani-Cuvelier, L.; Loiseau, A.-M.; Perichet, C.; Delbecque, C.; Arnaudo, J.-F.,
Chemical composition of the essential oils from Turkish and Honduras Styrax,
Flavour Fragr. J., 2005, 20, 1, 70-73, https://doi.org/10.1002/ffj.1370
. [all data]
Figuérédo, Cabassu, et al., 2005
Figuérédo, G.; Cabassu, P.; Chalchat, J.-C.; Pasquier, B.,
Studies of Mediterranean oregano populations- V. Chemical composition of essential oils of oregano: Origanum syriacum L. var. bevanii (Holmes) Ietswaart, O. syriacum L. var. sinaicum (Boiss.) Ietswaart, and O. syriacum L. var. syriacum from Lebanon and Israel,
Flavour Fragr. J., 2005, 20, 164-168. [all data]
Khalighi-Sigaroodi, Hadijiakhoondi, et al., 2005
Khalighi-Sigaroodi, F.; Hadijiakhoondi, A.; Shahverdi, A.R.; Mozaffarian, V.-A.; Shafiee, A.,
Chemical composition and antimicrobial activity of the essential oil of Ferulago Bernardii Tomk. and M.Pimen.,
DARU, 2005, 13, 3, 100-104. [all data]
Sajjadi and Ghannadi, 2005
Sajjadi, S.-E.; Ghannadi, A.,
Essential oil of the Persian sage, Salvia rhytidea Benth.,
Acta Pharm. Sin., 2005, 55, 321-326. [all data]
Velasco-Negueruela, Pérez-Alonso, et al., 2005
Velasco-Negueruela, A.; Pérez-Alonso, M.J.; Palá-Paúl, J.; Iñigo, A.; López, G.,
The volatile oil composition of the berries of Juniperus macrocarpa Sibth. and Sm., gathered in Spain,
J. Essent. Oil Res., 2005, 17, 1, 61-63, https://doi.org/10.1080/10412905.2005.9698831
. [all data]
Perez-Alonso, Velasco-Negueruela, et al., 2003
Perez-Alonso, M.J.; Velasco-Negueruela, A.; Palá-Paúl, J.; Sanz, J.,
Variations in the essential oil composition of Artemisia pedemontana gathered in Spain: chemotype camphor-1,8-cineole and chemotype davanone,
Biochem. Syst. Ecol., 2003, 31, 1, 77-84, https://doi.org/10.1016/S0305-1978(02)00082-0
. [all data]
Zoghbi, Andrade, et al., 2003
Zoghbi, M.G.B.; Andrade, E.H.A.; da Silva, M.H.; Carreira, L.M.M.; Maia, J.G.S.,
Essential oils from three Myrcia species,
Flavour Fragr. J., 2003, 18, 5, 421-424, https://doi.org/10.1002/ffj.1242
. [all data]
Gallori, Flamini, et al., 2001
Gallori, S.; Flamini, G.; Bilia, A.R.; Morelli, I.; Landini, A.; Vincieri, F.F.,
Chemical composition of some traditional herbal drug preparations: essential oil and aromatic water of costmary (Balsamita suaveolens Pers.),
J. Agric. Food Chem., 2001, 49, 12, 5907-5910, https://doi.org/10.1021/jf0107656
. [all data]
Tellez, Canel, et al., 1999
Tellez, M.R.; Canel, C.; Rimando, A.M.; Duke, S.O.,
Differential accumulation of isoprenoids in glanded and glandless Artemisia annua L,
Phytochemistry, 1999, 52, 6, 1035-1040, https://doi.org/10.1016/S0031-9422(99)00308-8
. [all data]
Doneanu and Anitescu, 1998
Doneanu, C.; Anitescu, G.,
Supercritical carbon dioxide extraction of Angelica archangelica L. root oil,
J. Supercrit. Fluids, 1998, 12, 1, 59-67, https://doi.org/10.1016/S0896-8446(97)00040-5
. [all data]
Costa, De Fina, et al., 2008
Costa, R.; De Fina, M.R.; Valentino, M.R.; Rustaiyan, A.; Dugo, P.; Dugo, G.; Mondello, L.,
An investigation on the volatile composition of some Artemisia species from Iran,
Flavour Fragr. J., 2008, 24, 2, 75-82, https://doi.org/10.1002/ffj.1919
. [all data]
Ozer H., Sokmen M., et al., 2007
Ozer H.; Sokmen M.; Gulluce M.; Adiguzel A.; Sahin F.; Sokmen A.; Kilic H.; Baris O.,
Chemical Composition and Antimicrobial and Antioxidant Activities of the Essential Oil and Methanol Extract of Hippomarathrum microcarpum (Bieb.) from Turkey,
J. Agric. Food Chem., 2007, 55, 3, 937-942, https://doi.org/10.1021/jf0624244
. [all data]
Tognolini, Barocelli, et al., 2006
Tognolini, M.; Barocelli, E.; Ballabeni, V.; Bruni, R.; Bianchi, A.; Chiavarini, M.; Impicciatore, M.,
Comparative screening of plant essential oils: Phenylpropanoid moiety as basic core for antiplatelet activity,
Life Sciences, 2006, 78, 13, 1419-1432, https://doi.org/10.1016/j.lfs.2005.07.020
. [all data]
Hamm, Bleton, et al., 2005
Hamm, S.; Bleton, J.; Connan, J.; Tchapla, A.,
A chemical investigation by headspace SPME and GC-MS of volatile and semi-volatile terpenes in various olibanum samples,
Phytochemistry, 2005, 66, 12, 1499-1514, https://doi.org/10.1016/j.phytochem.2005.04.025
. [all data]
Hafez and Abdel-Salam, 2004
Hafez, S.S.; Abdel-Salam, H.A.,
chemical composition and antimicrobial activity of the volatile constituents of thuja occidentalis L. growing in Egipt,
Alexandria J. Pharm. Sci., 2004, 18, 1, 41-47. [all data]
Hamm, Bleton, et al., 2004
Hamm, S.; Bleton, J.; Tchapla, A.,
Headspace solid phase microextraction for screening for the presence of resins in Egyptian archaeological samples,
J. Sep. Sci., 2004, 27, 3, 235-243, https://doi.org/10.1002/jssc.200301611
. [all data]
Vinogradov, 2004
Vinogradov, B.A.,
Production, composition, properties and application of essential oils, 2004, retrieved from http://viness.narod.ru. [all data]
Weyerstahl, Marschall, et al., 1997
Weyerstahl, P.; Marschall, H.; Seelmann, I.; Rustaiyan, A.,
Constituents of the essential oil of Achillea eriophora DC,
Flavour Fragr. J., 1997, 12, 2, 71-78, https://doi.org/10.1002/(SICI)1099-1026(199703)12:2<71::AID-FFJ620>3.0.CO;2-E
. [all data]
Zenkevich, 1996
Zenkevich, I.G.,
Analytical Parameters of Components of Essential Oils for their Chromatographic and Chromato-Mass Spectral Identification. Mono- and Sesquiterpenes,
Rastitelnye Resursy (Plant resources), 1996, 34, 1-2, 48-58. [all data]
Kurose, Okamura, et al., 2007
Kurose, K.; Okamura, D.; Yatagai, M.,
Composition of the essential oils from the leaves of nine Pinus species and the cones of three of Pinus species,
Flavour Fragr. J., 2007, 22, 1, 10-20, https://doi.org/10.1002/ffj.1609
. [all data]
Wedge, Klun, et al., 2009
Wedge, D.E.; Klun, J.A.; Tabanca, N.; Demirci, B.; Ozek, T.; Baser, K.H.C.; Liu, Z.; Zhang, S.; Cantrell, C.L.; Zhang, J.,
Bioactivity-guided fractionation and GC/MS fingerprinting of Amgelica sinensis and Angelica archangelica root components for antifungal and mosquito deterrent activity,
J. Agric. Food Chem., 2009, 57, 2, 464-470, https://doi.org/10.1021/jf802820d
. [all data]