dotriacontanoic acid
- Formula: C32H64O2
- Molecular weight: 480.8494
- CAS Registry Number: 3625-52-3

Phase change data

Data compiled by: Thermodynamics Research Center, NIST Boulder Laboratories, Chris Muzny director
Quantity | Value | Units | Method | Reference | Comment |
---|---|---|---|---|---|
Tfus | 361.2 | K | N/A | Liu, 1952 | Uncertainty assigned by TRC = 2. K |

References

Liu, 1952
Liu, S.-L.,
Fatty Acids from Lanolin, Essays and Papers in Memory of Late President Fu Ssu-Nien 199-213 1952, 1952. [all data]