Ethanimidic acid, N-methyl-, methyl ester
- Formula: C4H9NO
- Molecular weight: 87.1204
- IUPAC Standard InChIKey: ZVSTUQXCWRZVJO-PLNGDYQASA-N
- CAS Registry Number: 3619-34-9
- Chemical structure:
View 3d structure (requires JavaScript / HTML 5) - Permanent link for this species. Use this link for bookmarking this species for future reference.

Reaction thermochemistry data

Data compiled by: Hussein Y. Afeefy, Joel F. Liebman, and Stephen E. Stein
Individual Reactions
By formula: C4H9NO = C4H9NO
Quantity | Value | Units | Method | Reference | Comment |
---|---|---|---|---|---|
ΔrH° | 67. ± 3. | kJ/mol | Eqk | Beak, Lee, et al., 1978 | liquid phase |

References

Beak, Lee, et al., 1978
Beak, P.; Lee, J.-K.; Zeigler, J.M.,
Equilibration studies: amide-imidate and thioamide-thioimidate functions,
J. Org. Chem., 1978, 43, 1536-1538. [all data]