Phenylmaleic anhydride
- Formula: C10H6O3
- Molecular weight: 174.1528
- IUPAC Standard InChIKey: QZYCWJVSPFQUQC-UHFFFAOYSA-N
- CAS Registry Number: 36122-35-7
- Chemical structure:
View 3d structure (requires JavaScript / HTML 5) - Other names: 2,5-Furandione, 3-phenyl-; 3-phenylfuran-2,5-dione

Gas phase ion energetics data

Data compiled by: John E. Bartmess
Electron affinity determinations
EA (eV) | Method | Reference | Comment |
---|---|---|---|
1.743 ± 0.043 | IMRE | Paul and Kebarle, 1989 | ΔGea(423 K) = -38.0±1 kcal/mol, ΔS = -3±3 eu (est). |

References

Paul and Kebarle, 1989
Paul, G.; Kebarle, P.,
Electron Affinities of Cyclic Unsaturated Dicarbonyls: Maleic Anhydrides, Maleimides, and Cyclopentendione,
J. Am. Chem. Soc., 1989, 111, 2, 464, https://doi.org/10.1021/ja00184a009
. [all data]