5-Chloro-2'-fluoro-2-diethyaminoethylaminobenzophenone
- Formula: C19H22ClFN2O
- Molecular weight: 348.842
- IUPAC Standard InChIKey: VOXNSVGFHTWQLC-UHFFFAOYSA-N
- CAS Registry Number: 36105-18-7
- Chemical structure:
View 3d structure (requires JavaScript / HTML 5) - Other names: 2-[2-(Diethylamino-ethylamino]-5-chloro-2'-fluorobenzophenone; 2-Diethylamino-ethylamino-5-chloro-2'-fluoro-benzophenone; Benzophenone, 5-chloro-2-diethylaminoethylamino-2'-fluoro; 2-diethylamino-ethylamino-5-chlor-2'-fluor-benzophenone; Flurazepam, hydrolysis

Kovats' RI, non-polar column, isothermal

Column type | Active phase | Temperature (C) | I | Reference | Comment |
---|---|---|---|---|---|
Packed | SE-30 | 250. | 2555. | Schütz, 1982 | N2 |
Packed | SE-30 | 280. | 2560. | Schütz, 1982 | N2 |

Kovats' RI, non-polar column, temperature ramp

Column type | Active phase | I | Reference | Comment |
---|---|---|---|---|
Capillary | Cross-Linked Methylsilicone | 2555. | Maurer and Pfleger, 1987 | 12. m/0.2 mm/0.33 μm, He, 100. C @ 3. min, 30. K/min, 310. C @ 5. min |

Normal alkane RI, non-polar column, custom temperature program

Column type | Active phase | I | Reference | Comment |
---|---|---|---|---|
Capillary | HP-5MS | 2555. | Augsburger, Rivier, et al., 1998 | 30. m/0.25 mm/0.25 μm; Program: not specified |
Other | Methyl Silicone | 2558. | Ardrey and Moffat, 1981 | Program: not specified |

References

Schütz, 1982
Schütz, H.,
Benzodiazepines, Springer-Verlag, New York, 1982, 438. [all data]
Maurer and Pfleger, 1987
Maurer, H.; Pfleger, K.,
Identification and differentiation of benzodiazepines and their metabolites in urine by computerized gas chromatography-mass spectrometry,
J. Chromatogr., 1987, 422, 85-101, https://doi.org/10.1016/0378-4347(87)80442-5
. [all data]
Augsburger, Rivier, et al., 1998
Augsburger, M.; Rivier, L.; Mangin, P.,
Comparison of different immunoassays and GC-MS screening of benzodiazepines in urine,
J. Pharm. Biomed. Anal., 1998, 18, 4-5, 681-687, https://doi.org/10.1016/S0731-7085(98)00266-0
. [all data]
Ardrey and Moffat, 1981
Ardrey, R.E.; Moffat, A.C.,
Gas-liquid chromatographic retention indices of 1318 substances of toxicological interest on SE-30 or OV-1 stationary phase,
J. Chromatogr., 1981, 220, 3, 195-252, https://doi.org/10.1016/S0021-9673(00)81925-1
. [all data]