Benzeneacetic acid, α-hydroxy-α-phenyl-, 1-methyl-4-piperidinyl ester
- Formula: C20H23NO3
- Molecular weight: 325.4015
- IUPAC Standard InChIKey: UGYPGJCVNPPUPE-UHFFFAOYSA-N
- CAS Registry Number: 3608-67-1
- Chemical structure:
View 3d structure (requires JavaScript / HTML 5) - Other names: 4-NMPB; 1-Methyl-4-piperidyl benzilate; α-Hydroxy-diphenylacetic acid, 1-methyl -4-piperidinyl ester; 1-Methyl-4-piperidyl benzylate; Enpiperate; NSC 172167; 1-methyl-4-piperidyl diphenylglycolate

Van Den Dool and Kratz RI, non-polar column, temperature ramp

Column type | Active phase | I | Reference | Comment |
---|---|---|---|---|
Capillary | SE-54 | 2431. | Kostiainen, 2000 | 25. m/0.32 mm/0.25 μm, He, 40. C @ 1. min, 10. K/min, 280. C @ 10. min |

References

Kostiainen, 2000
Kostiainen, O.,
Gas Chromatography in Screening of Chemicals Related to the Chemical Weapons Convention
in Encyclopedia of Analytical Chemistry, Meyers, R.A., ed(s)., John Wiley Sons Ltd, Chichester, 2000, 963-979. [all data]