Cholestan-3-ol, (3β,5β)-
- Formula: C27H48O
- Molecular weight: 388.6694
- IUPAC Standard InChIKey: QYIXCDOBOSTCEI-LNXFVTSZSA-N
- CAS Registry Number: 360-68-9
- Chemical structure:
View 3d structure (requires JavaScript / HTML 5) - Stereoisomers:
- Other names: Coprostanol; Coprosterol; Koprosterin; Koprosterol; Stercorin; 3β-Hydroxy-5β-cholestanol; 5β-Cholestan-3β-ol; Coprostan-3-β-ol; Coprostan-3-ol; 5β-Coprostanol; NSC 18175; 5β-cholestanol

Phase change data

Data compiled by: William E. Acree, Jr., James S. Chickos
Enthalpy of fusion
ΔfusH (kJ/mol) | Temperature (K) | Reference |
---|---|---|
16.1 | 373.8 | MINAMI, SAKAMOTO, et al., 2002 |

Kovats' RI, non-polar column, isothermal

Column type | Active phase | Temperature (C) | I | Reference | Comment |
---|---|---|---|---|---|
Capillary | Methyl Silicone | 250. | 3085. | Shlyakhov, 1984 |

Van Den Dool and Kratz RI, non-polar column, custom temperature program

Column type | Active phase | I | Reference | Comment |
---|---|---|---|---|
Capillary | VF-5MS | 3076.4 | Tret'yakov, 2007 | 30. m/0.25 mm/0.25 μm, He; Program: Multi-step temperature program; T(initial)=60C; T(final)=270C |

References

MINAMI, SAKAMOTO, et al., 2002
MINAMI, Hideyuki; SAKAMOTO, Yukari; IWAHASHI, Makio,
Phase Diagram for Binary Mixture of Sterols: 5-cholesten-3.BETA.-ol, 5.ALPHA.-cholestan-3.BETA.-ol, 5.BETA.-cholestan-3.ALPHA.-ol and 5.BETA.-cholestan-3.BETA.-ol.,
J. Oleo Sci., 2002, 51, 1, 11-17, https://doi.org/10.5650/jos.51.11
. [all data]
Shlyakhov, 1984
Shlyakhov, A.F.,
Gas chromatography in organic geochemistry, Nedra, Moscow, 1984, 221. [all data]
Tret'yakov, 2007
Tret'yakov, K.V.,
Retention Data. NIST Mass Spectrometry Data Center., NIST Mass Spectrometry Data Center, 2007. [all data]